program: Gaussian 09
title: 000145220
version: EM64L-G09RevD.01
frameworkgroup: C1[X(C10H10O2)]
method: RPBEPBE
basis: SDD
operation: Freq
keyword: #pfreq=noraman
keyword: PBEPBE/SDD
title: #p freq=noraman PBEPBE/SDD
converged: YES YES NO NO
title: Mulliken charges:
elementType: O O C C C C C C C C C C H H H H H H H H H H
charge: -0.254812 -0.234358 -0.545748 0.225003 -0.308444 0.206945 -0.499542 0.331510 -0.350893 -0.346785 0.093388 -0.791935 0.242518 0.245806 0.230141 0.233466 0.252286 0.255535 0.282474 0.235675 0.235619 0.262152
chargesum: 0.00000
title: Mulliken charges with hydrogens summed into heavy atoms:
elementType: O O C C C C C C C C C C
charge: -0.254812 -0.234358 -0.057424 0.225003 0.155163 0.206945 -0.247256 0.331510 -0.095359 -0.064311 0.093388 -0.058490
polarizability: 1.74738777e+02 -4.19705954e+00 1.14192656e+02 2.91828441e-02 2.10327864e-01 5.79802797e+01
1716.lowfreq: -9.1549 -3.5841 0.0004 0.0006 0.0009 6.5680 63.0849 67.7165 118.0067
frequency: 63.0330 67.7054 118.0062 143.9965 170.1751 197.3808 292.8426 323.2152 364.0502 419.7208 455.8377 507.7527 557.6134 591.3946 612.2552 672.6450 688.9268 734.5967 777.3755 818.7216 844.4126 886.5644 895.3223 906.4105 944.4152 980.5195 986.8009 1025.1870 1052.0058 1059.8458 1098.0460 1152.0217 1161.1296 1195.3048 1226.2675 1248.0296 1281.2529 1296.5728 1340.7341 1364.7926 1380.4864 1443.2851 1448.0089 1462.1777 1464.4485 1477.8586 1487.0485 1567.7204 1604.2718 1620.0687 2983.1084 2999.1003 3025.9725 3059.0271 3067.7911 3110.2773 3123.4206 3145.9346 3152.4895 3177.2703
redmass: 4.2484 2.1627 4.4134 1.0337 4.2456 3.1803 6.2276 5.5074 4.8267 2.8633 3.6425 3.4222 6.0436 4.6213 2.5858 4.6067 5.3056 3.6256 5.3272 1.5872 1.4032 4.4440 1.8218 2.5043 2.0289 3.2927 1.3403 1.8152 1.6926 2.0949 2.4293 1.4164 1.2046 1.1995 2.2291 1.3903 1.5522 2.9676 1.4223 1.3650 4.8114 3.1809 1.2709 1.1738 1.0498 1.5755 1.5064 7.1987 8.1890 7.2417 1.0374 1.0615 1.0650 1.0989 1.0971 1.1073 1.0990 1.0916 1.0891 1.0965
irintensity: 2.7899 0.8775 2.3855 0.2065 1.7150 10.1660 0.4670 1.0170 12.6601 4.4572 5.9129 0.1564 12.2615 10.7231 4.1439 3.1938 2.7991 6.0482 5.1423 7.8398 46.6415 2.3951 34.5047 56.9563 34.1041 6.2843 1.3344 1.0284 1.6187 18.4140 65.4892 4.9437 6.8787 42.2272 25.8901 72.6207 49.3450 293.3242 2.2430 46.9477 30.8551 3.9008 35.4450 10.0797 19.9011 12.8449 33.7108 224.3779 61.7331 54.9655 4.5622 24.7663 65.0072 18.6025 15.0213 29.1178 17.3751 7.8668 0.0270 6.4191
temp: 298.150 k
press: 1.00000 atm
elementType: 8 8 6 6 6 6 6 6 6 6 6 6 1 1 1 1 1 1 1 1 1 1
symmnumber: 1
zpe: 456510.8 jmol-1
zpe.correction: 0.173876 hartree
zpe.thermalcorrener: 0.184433 hartree
zpe.thermalcorrenthalpy: 0.185377 hartree
zpe.thermalcorrgfe: 0.137158 hartree
zpe.sumelectzpe: -536.641585 hartree
zpe.sumelectthermal: -536.631028 hartree
zpe.sumelectthermalent: -536.630084 hartree
zpe.sumelectthermalfe: -536.678303 hartree
dipole: 3.7735 -4.0852 0.1257
dipole: 5.5627
quadrupole: -76.3210 -64.5208 -70.9941
quadrupole: 1.3379 0.6197 0.0354
quadrupole: -5.7090 6.0912 -0.3821 1.3379 0.6197 0.0354
hfenergy: -536.8154606 hartree
pointgroup: C01 [X(C10H10O2)]
dipole: 1.4818585 -1.6096819 0.0520706 debye
dipolederiv: -1.6443761 0.1257442 -0.0546404 0.0824274 -0.3842273 0.0297272 0.0292947 0.0065463 -0.2680817 -1.1803033 0.105599 -0.0026128 0.4255522 -0.6472986 -0.0000296 0.0018669 -0.0026595 -0.3236614 -0.1491701 -0.0394235 -0.0133562 0.093237 -0.0265701 -0.0056956 -0.0050178 -0.0214179 0.1633587 -0.3179747 -0.0887281 -0.0202051 -0.6916906 -0.0228734 -0.0058699 -0.0506552 0.0222538 -0.0830741 0.5683658 -0.1261306 0.0217263 -0.4941421 0.3758836 -0.0523661 0.0507073 -0.0293803 0.3540155 1.5006749 -0.0468161 0.0397769 0.3174452 0.0731019 0.0163911 -0.0068295 0.0095919 0.0860014 0.412677 0.0209634 0.0092935 -0.0511909 0.0681322 0.0026869 0.0148684 0.0029843 -0.1371194 -1.0864104 -0.1349804 -0.0100281 -0.2640171 -0.2908286 -0.0045469 0.0011856 -0.0080839 -0.0286769 -0.4912223 0.0102604 -0.0075346 0.2751419 0.0862538 0.0070706 -0.0150419 0.0015194 -0.1816589 0.2487181 0.0482125 0.0033625 0.2253553 0.1117935 0.0034298 0.0049408 0.0039284 -0.1015431 1.9791605 0.1715408 0.0088518 0.1522897 0.9188849 0.005244 0.0024331 0.0079408 0.106277 -0.1094891 -0.1345674 -0.0014649 -0.2943444 -0.4499584 -0.0043642 -0.0024999 -0.0045518 0.0615678 0.0656343 0.0070467 0.0051362 0.0379654 -0.044561 0.0857138 -0.0338289 0.1257007 0.0064892 0.0331483 0.03382 0.0065789 0.035518 0.0096963 -0.0787747 0.0489189 -0.124178 -0.0674576 0.0074773 0.0071187 -0.0590656 0.1025425 0.0325081 0.0092589 -0.1696297 0.0283774 -0.1162478 -0.089799 0.026013 0.0762914 0.0697089 0.0593555 -0.0019596 0.1371601 -0.0143688 0.0058341 0.1001251 -0.0475283 -0.0020715 -0.062858 -0.0657062 -0.0032918 -0.0064177 -0.0020177 0.1376546 0.060307 -0.062393 -0.0008528 -0.0518145 -0.0392145 -0.0025903 -0.004711 -0.0033926 0.1748407 0.080453 0.0946247 0.000645 0.0356923 0.0467229 -0.0009529 0.00246 -0.0001008 0.1514408 0.0662681 0.0374605 -0.0950174 0.0159393 0.0449783 0.059838 -0.0623207 0.0832482 -0.0283354 0.0673297 0.03589 0.0953452 0.0146959 0.0470656 -0.0587645 0.0622544 -0.0820342 -0.0309718 -0.1215944 -0.0437265 -0.0001583 0.0265466 0.0968616 -0.0001544 0.0008622 0.0000942 0.1193482 unknown
polarizability: 174.7135765|-4.2892248|114.1972854|1.2451352|0.6278739|58.0008509 unknown
InChI: InChI=1S/C10H10O2/c1-7(11)8-2-3-10-9(6-8)4-5-12-10/h2-3,6H,4-5H2,1H3
charge 0 multiplicity 1
22 atoms
O  2.885288 0.800868 0.016644
O  -3.545007 0.840164 0.000664
C  2.287577 -1.588805 -0.059952
C  1.062108 -0.683226 -0.006062
C  3.458804 -0.586837 0.17389
C  1.494573 0.666182 0.011384
C  -0.307754 -0.972335 -0.014654
C  -1.251262 0.099454 -0.004282
C  0.594473 1.750683 0.013613
C  -0.779979 1.445334 0.006597
C  -2.72987 -0.132702 -0.005628
C  -3.2520 -1.569197 -0.015218
H  2.272082 -2.378125 0.711487
H  2.369522 -2.084593 -1.045144
H  3.863894 -0.645652 1.199262
H  4.276693 -0.672888 -0.557528
H  -0.650925 -2.01223 -0.031476
H  0.958018 2.781554 0.025292
H  -1.530912 2.242396 0.013445
H  -2.899973 -2.128033 0.872044
H  -2.903505 -2.114264 -0.912463
H  -4.352245 -1.547847 -0.013114
