program: Gaussian 09
title: 000145212
version: EM64L-G09RevD.01
frameworkgroup: C1[X(C12H20Si)]
method: RPBEPBE
basis: SDD
operation: Freq
keyword: #p
keyword: freq=noraman
keyword: PBEPBE/SDD
title: #p freq=noraman PBEPBE/SDD
converged: YES YES NO NO
title: Mulliken charges:
elementType: Si C C C C C C C C C C C C H H H H H H H H H H H H H H H H H H H H
charge: 1.313436 -0.101275 -0.152317 -1.047116 -1.044357 -0.703342 -0.704069 -0.702854 -0.318054 -0.315906 -0.239817 -0.241312 -0.236885 0.238614 0.243516 0.232161 0.238042 0.231912 0.243722 0.208386 0.208081 0.234983 0.215503 0.215748 0.209619 0.234191 0.208006 0.208984 0.222975 0.221890 0.224933 0.225060 0.227544
chargesum: 0.00000
title: Mulliken charges with hydrogens summed into heavy atoms:
elementType: Si C C C C C C C C C C C C
charge: 1.313436 -0.101275 -0.152317 -0.332825 -0.330681 -0.051891 -0.063200 -0.051673 -0.095078 -0.094016 -0.014885 -0.016252 -0.009341
polarizability: 1.83408767e+02 -9.33811300e+00 1.26590707e+02 -5.56554091e+00 -1.28957096e+01 1.40221430e+02
1716.lowfreq: -26.6604 -12.6796 -10.7109 -0.0003 0.0008 0.0013 17.9620 30.1260 62.6741
frequency: 12.0943 29.9032 62.6454 107.6513 123.7311 133.0777 148.3691 159.5536 193.3897 198.5922 215.1901 227.5300 233.2981 260.3792 262.8752 314.3013 326.7048 372.0692 384.2157 391.5143 412.1619 478.8494 544.8363 615.8167 642.8869 687.3059 696.4960 706.5922 747.9366 799.2985 803.3828 811.6279 860.5262 874.6294 892.1542 922.1157 936.5465 937.8928 941.6077 978.5164 988.0212 996.8742 1003.3825 1009.3465 1023.6472 1075.3479 1100.3882 1172.9040 1195.1474 1196.6414 1198.0898 1198.9151 1286.8069 1297.4866 1310.4476 1362.9796 1371.5767 1372.4109 1398.4872 1417.8247 1442.5282 1447.3661 1450.8806 1457.3472 1462.2051 1465.6705 1466.6420 1471.6316 1482.1399 1482.1675 1491.3141 1575.6385 1596.5425 2949.2182 2949.6456 2954.1780 2980.9757 2982.2552 3035.4116 3035.9536 3042.1313 3057.5581 3063.2040 3064.8815 3081.5952 3082.7698 3084.6418 3085.7855 3109.5620 3111.0158 3126.4857 3137.9741 3156.9014
redmass: 3.4478 2.6244 3.8028 1.2862 1.7210 1.1482 2.4826 3.0047 2.2119 1.0887 3.0085 1.7812 2.0784 1.3898 1.2870 3.1506 3.1925 2.6552 2.4689 2.7591 3.5260 3.4156 2.9814 6.4351 4.4324 5.1170 2.6462 1.7474 1.7961 1.5661 1.3141 2.7020 1.2485 1.4888 1.4598 1.3708 1.6633 1.6872 1.2204 1.4017 6.2228 1.3088 1.3946 1.4024 3.0109 1.7250 2.7422 1.0562 2.2633 2.7860 1.1353 2.7203 1.2177 1.1935 1.4486 4.4404 1.1880 1.1926 1.1963 2.1289 1.0556 1.0548 1.0525 1.0906 1.0501 1.0496 1.0473 1.8720 1.0507 1.0497 1.0527 5.4540 5.8321 1.0362 1.0362 1.0366 1.0344 1.0342 1.0974 1.0976 1.0955 1.1001 1.0990 1.0988 1.0980 1.0980 1.0980 1.0979 1.0856 1.0867 1.0907 1.0957 1.1014
irintensity: 0.0042 0.0000 0.0582 0.0220 0.1103 0.0818 0.1322 0.6130 0.2494 0.0945 3.2236 0.1249 0.1861 0.1328 0.1412 2.5807 3.0263 1.1254 2.0952 0.0173 16.9357 16.4878 7.5206 0.0508 14.9269 6.9559 11.1282 55.8452 40.9424 32.6366 11.2564 14.4288 0.2336 144.9588 87.8821 0.6583 2.9981 5.7223 0.3357 0.0495 0.7093 0.0769 6.9711 3.6915 0.4235 2.3923 31.8866 0.1308 13.3902 0.7395 1.1310 1.2040 38.2619 30.3932 16.6557 1.6659 12.3070 19.2582 12.3786 14.2007 2.7592 2.3151 16.5223 9.5698 0.2336 0.2780 0.2583 4.9565 5.8112 10.1516 28.5223 0.0577 0.0587 38.2451 39.6814 67.2967 16.3501 10.0087 10.3640 4.6095 114.8324 6.9959 40.5449 52.8244 9.9460 15.6862 22.6102 28.2015 6.6645 6.1137 6.5030 51.3871 33.5214
temp: 298.150 k
press: 1.00000 atm
elementType: 14 6 6 6 6 6 6 6 6 6 6 6 6 1 1 1 1 1 1 1 1 1 1 1 1 1 1 1 1 1 1 1 1
symmnumber: 1
zpe: 740543.5 jmol-1
zpe.correction: 0.282058 hartree
zpe.thermalcorrener: 0.298821 hartree
zpe.thermalcorrenthalpy: 0.299765 hartree
zpe.thermalcorrgfe: 0.237142 hartree
zpe.sumelectzpe: -757.676275 hartree
zpe.sumelectthermal: -757.659512 hartree
zpe.sumelectthermalent: -757.658568 hartree
zpe.sumelectthermalfe: -757.721192 hartree
dipole: -0.1368 -0.0090 -0.0058
dipole: 0.1373
quadrupole: -84.9027 -90.2754 -86.9036
quadrupole: -1.8563 -1.1043 -3.1505
quadrupole: 2.4578 -2.9148 0.4570 -1.8563 -1.1043 -3.1505
hfenergy: -757.9583334 hartree
pointgroup: C01 [X(C12H20Si1)]
dipole: 0.0538941 -0.0020269 -0.0027102 debye
polarizability: 183.061096|7.1839123|137.5681223|9.4286927|-13.8493034|129.5916855 unknown
InChI: InChI=1S/C12H20Si/c1-12(2,3)13(4,5)11-9-7-6-8-10-11/h6-10H,1-5H3
charge 0 multiplicity 1
33 atoms
Si 1.017335 0.488243 0.692759
C  2.146689 -0.427594 -0.620015
C  -0.832851 0.1870 0.272914
C  1.380925 -0.192222 2.446994
C  1.365377 2.372301 0.655481
C  1.84554 0.112179 -2.045124
C  3.643923 -0.179871 -0.285607
C  1.859868 -1.953731 -0.587117
C  -1.548354 -0.910787 0.82932
C  -1.53469 1.044117 -0.621608
C  -2.905222 -1.145797 0.507281
C  -2.89129 0.816189 -0.949244
C  -3.581155 -0.282173 -0.385501
H  2.42336 0.026814 2.742697
H  0.712181 0.275313 3.192945
H  1.23941 -1.287023 2.503907
H  2.405353 2.585527 0.96386
H  1.219697 2.801008 -0.3528
H  0.689854 2.904311 1.350329
H  2.064244 1.194078 -2.131817
H  2.476473 -0.413633 -2.79116
H  0.787996 -0.048811 -2.326556
H  3.91278 -0.566628 0.715967
H  3.901804 0.895955 -0.319111
H  4.288034 -0.698463 -1.025362
H  0.800672 -2.174438 -0.817525
H  2.484298 -2.474302 -1.342127
H  2.097099 -2.395802 0.399625
H  -1.045994 -1.590066 1.529969
H  -1.02158 1.907104 -1.065449
H  -3.433316 -1.997454 0.952094
H  -3.408321 1.493194 -1.639454
H  -4.633242 -0.460837 -0.636264
