program: Gaussian 09
title: 000145209
version: EM64L-G09RevD.01
frameworkgroup: C1[X(C8H12N2)]
method: RPBEPBE
basis: SDD
operation: Freq
keyword: #pfreq=noraman
keyword: PBEPBE/SDD
title: #p freq=noraman PBEPBE/SDD
converged: NO YES NO NO
title: Mulliken charges:
elementType: N N C C C C C C C C H H H H H H H H H H H H
charge: -0.028993 -0.017830 -0.111352 -0.494998 -0.443785 -0.440243 -0.080091 -0.473901 -0.483335 -0.190380 0.222837 0.221239 0.235377 0.215544 0.210640 0.220120 0.210251 0.263800 0.233772 0.239808 0.229540 0.261981
chargesum: 0.00000
title: Mulliken charges with hydrogens summed into heavy atoms:
elementType: N N C C C C C C C C
charge: -0.028993 -0.017830 0.111486 -0.038381 -0.017602 -0.009872 0.183709 -0.000321 0.008185 -0.190380
polarizability: 1.04368308e+02 -2.80139018e+00 7.80410212e+01 -3.49117567e+00 3.53509936e-01 8.09579506e+01
1716.lowfreq: -27.9402 -13.9619 0.0004 0.0006 0.0006 21.0096 54.6839 143.5093 170.9049
frequency: 54.3699 143.4586 170.8707 283.7245 303.5017 360.1136 380.3447 442.2894 514.1334 540.6496 592.6632 603.9902 750.6646 769.5127 793.7632 807.8487 827.5912 873.1510 906.4575 932.6699 970.7600 984.9872 1004.1047 1028.2066 1037.6289 1061.5996 1096.3019 1123.4571 1145.9909 1185.7277 1200.5749 1233.8152 1249.9491 1273.2344 1278.8984 1304.2166 1311.3235 1312.9649 1321.9362 1336.3061 1342.7833 1346.5686 1462.8225 1466.4969 1470.8474 1476.3791 1485.9827 2193.9733 2984.2806 2986.8231 2995.5072 3002.7291 3004.2358 3012.6814 3035.7088 3039.8563 3043.1720 3065.0528 3071.3593 3078.1115
redmass: 3.0050 5.8318 2.6092 1.9673 2.2889 2.9873 2.4220 4.7258 4.8636 5.4985 6.9136 3.9071 3.9562 2.1713 2.0888 1.6398 1.5880 3.0126 3.4081 1.6431 2.8981 2.3611 3.1417 3.1988 2.7842 2.8966 1.6064 1.5208 1.1038 1.2964 1.3352 1.1166 1.4372 1.4405 1.3744 1.3157 1.2948 1.3893 1.3168 1.4413 1.3915 1.4158 1.0796 1.0823 1.0817 1.0804 1.0868 12.5926 1.0599 1.0596 1.0779 1.0663 1.0615 1.0617 1.0904 1.0999 1.1038 1.1051 1.1054 1.1059
irintensity: 1.8753 2.3261 0.8234 0.4921 0.6064 0.1399 0.2499 0.3036 1.4765 1.8019 3.7673 8.3158 9.6119 14.6340 3.2121 3.9847 7.7013 0.5065 2.0226 3.5524 10.8042 5.2624 5.4228 15.7770 9.6665 11.0346 2.3623 0.0114 0.1749 5.3089 4.1602 0.2994 3.4997 6.0879 9.7586 1.9604 2.1686 3.3529 2.5833 3.4912 1.0688 2.9860 0.7957 6.7712 20.0758 17.6131 3.1784 5.7637 34.6403 31.4600 6.5045 32.5776 72.3393 49.7689 35.7746 17.5602 14.0371 9.6077 52.9505 61.9382
temp: 298.150 k
press: 1.00000 atm
elementType: 7 7 6 6 6 6 6 6 6 6 1 1 1 1 1 1 1 1 1 1 1 1
symmnumber: 1
zpe: 496923.5 jmol-1
zpe.correction: 0.189268 hartree
zpe.thermalcorrener: 0.197761 hartree
zpe.thermalcorrenthalpy: 0.198705 hartree
zpe.thermalcorrgfe: 0.155831 hartree
zpe.sumelectzpe: -420.746006 hartree
zpe.sumelectthermal: -420.737513 hartree
zpe.sumelectthermalent: -420.736569 hartree
zpe.sumelectthermalfe: -420.779443 hartree
dipole: 4.8932 0.9164 -1.0971
dipole: 5.0978
quadrupole: -75.4431 -61.3417 -56.3576
quadrupole: -1.3777 2.4180 0.9239
quadrupole: -11.0623 3.0391 8.0232 -1.3777 2.4180 0.9239
hfenergy: -420.935274 hartree
pointgroup: C01[X(C8H12N2)]
dipole: -1.9220633 0.4129118 0.3971166 debye
dipolederiv: -0.5053968 0.1194762 0.0608159 0.1451144 -0.5228486 0.0241365 0.0326164 -0.0005868 -0.3989562 -0.3321054 0.0267184 -0.0343066 -0.0262467 -0.2121369 0.0023093 0.0307541 -0.0131852 -0.2267817 0.10357 -0.0101821 -0.0003379 0.0248259 0.1064733 -0.0138319 0.0267768 -0.0099737 0.0839173 -0.0798729 0.0009657 -0.0411018 -0.1235872 0.0058863 -0.0021204 -0.0765265 0.0041869 0.070781 0.0005626 -0.0226342 0.0662451 0.0272181 -0.0828044 0.0400904 0.0443821 0.0699702 0.0671556 0.0599371 0.0730774 0.0036222 0.0672652 -0.0102256 -0.0092983 0.0350858 -0.0631685 -0.0637882 0.4125973 0.0137194 0.1184677 0.0159547 0.3812448 0.0342103 0.1733216 0.0732184 0.2843619 0.3234923 0.007311 -0.0793072 -0.0000473 0.3178967 -0.0581445 -0.1299996 -0.0627477 0.2086253 0.1716734 -0.0816021 0.0049866 -0.1021161 0.2550364 0.0106617 0.0473196 0.0046565 0.3404605 0.1182065 -0.0307398 -0.036239 0.0512097 -0.1032279 -0.017447 -0.0818193 0.0095704 -0.0177618 -0.0302636 0.1051776 0.0086051 0.1050296 -0.1301558 -0.0105159 -0.0035603 -0.0053995 0.0537486 0.0491811 0.0442524 0.0161007 0.0145484 0.0171525 -0.0634566 -0.0111915 -0.1132589 -0.1513785 -0.0060094 -0.0771605 0.0546632 -0.0791272 -0.0356192 0.0444901 0.0720759 0.1036953 0.0309093 -0.1872831 -0.0164439 -0.0419641 -0.0163395 0.0448087 -0.016416 -0.1189491 -0.0075371 0.0532136 0.0672621 0.0068304 0.0055418 0.0422222 0.0298465 -0.0581848 0.0742785 -0.0557558 -0.1837058 0.0239853 -0.0834565 0.0852671 -0.0327004 -0.0814854 0.1319898 0.0511928 0.0835877 -0.0178706 -0.148359 0.0037604 -0.1363126 -0.0415469 0.0466272 -0.0325881 -0.0870569 -0.0184712 0.0173886 0.0215205 0.0066897 0.0172964 0.0099682 0.0399356 0.0463337 -0.0322635 0.0406337 -0.0799714 0.0508181 0.0574375 -0.0439499 0.034798 0.0164819 0.0610672 0.0036146 0.1265363 -0.1389082 -0.0387324 -0.0803599 -0.035615 -0.0587719 -0.0517502 -0.0605291 -0.0684095 -0.1229833 0.0302187 0.01078 -0.0775394 -0.1008329 -0.0412963 -0.0788645 -0.1049935 -0.0603984 -0.0667457 0.006784 -0.0855638 0.0147022 0.1083552 -0.016375 0.0477284 0.052237 0.0787564 0.0237581 0.0315582 unknown
polarizability: 104.2154145|2.3740138|78.033821|-4.2490419|0.0672435|81.1180441 unknown
InChI: InChI=1S/C8H12N2/c9-6-8-5-7-1-3-10(8)4-2-7/h7-8H,1-5H2
charge 0 multiplicity 1
22 atoms
N  -0.021741 -1.128827 -0.0511
N  3.275321 0.077918 -0.187853
C  -1.346288 1.114475 0.032616
C  0.05044 1.313837 0.681324
C  -2.123422 0.013016 0.805795
C  -1.158567 0.663308 -1.442397
C  0.766448 -0.099802 0.710947
C  -1.323219 -1.333379 0.663368
C  -0.285286 -0.642739 -1.445112
C  2.154024 -0.020451 0.207212
H  -1.904841 2.067047 0.068978
H  -0.04408 1.712762 1.707799
H  0.638265 2.041761 0.093555
H  -3.143869 -0.086826 0.391365
H  -2.228582 0.302589 1.868951
H  -0.670346 1.466037 -2.026004
H  -2.148785 0.480133 -1.900857
H  0.821277 -0.464665 1.755388
H  -1.108128 -1.782509 1.650055
H  -1.894896 -2.078067 0.081832
H  -0.786279 -1.462031 -1.989511
H  0.691455 -0.475888 -1.932351
