program: Gaussian 09
title: 000145208
version: EM64L-G09RevD.01
frameworkgroup: C1[X(C21H26O)]
method: RPBEPBE
basis: SDD
operation: Freq
keyword: #pfreq=noraman
keyword: PBEPBE/SDD
title: #p freq=noraman PBEPBE/SDD
converged: YES YES NO NO
title: Mulliken charges:
elementType: O C C C C C C C C C C C C C C C C C C C C C H H H H H H H H H H H H H H H H H H H H H H H H H H
charge: -0.421844 0.092226 0.167097 0.096659 0.325751 0.318027 0.255653 0.307298 0.469866 0.476111 -0.602252 -0.628921 -0.608435 -0.612390 0.073559 -0.857559 -0.860677 -0.840974 -0.845394 -0.818363 -0.820213 -0.814366 0.232578 0.230696 0.235483 0.231616 0.220759 0.223973 0.259121 0.252940 0.221919 0.227489 0.243908 0.225276 0.220650 0.217783 0.244473 0.217712 0.229596 0.226087 0.222292 0.231958 0.220887 0.221786 0.277608 0.225028 0.232339 0.355184
chargesum: 0.00000
title: Mulliken charges with hydrogens summed into heavy atoms:
elementType: O C C C C C C C C C C C C C C C C C C C C C
charge: -0.066660 0.092226 0.167097 0.096659 0.325751 0.318027 0.255653 0.307298 0.469866 0.476111 -0.369674 -0.398224 -0.372953 -0.380774 0.073559 -0.153706 -0.158329 -0.151139 -0.165425 -0.140388 -0.145583 -0.079391
polarizability: 2.94177352e+02 3.87575418e-01 2.30484449e+02 1.59494568e+01 -1.13927973e+00 1.93946632e+02
1716.lowfreq: -14.4713 -6.4537 -0.0009 -0.0004 0.0005 2.3646 15.1103 38.3310 50.3370
frequency: -13.6990 38.1842 50.2851 52.3555 56.8690 72.1955 105.7862 121.0934 140.5823 157.9720 162.4592 171.2789 180.6456 183.8107 189.3714 213.9170 220.8875 228.0934 233.0281 242.8268 264.8859 273.5099 276.1177 281.0040 307.3234 342.1522 347.3816 365.5417 391.8062 435.1296 470.3670 496.6916 502.1987 523.5666 526.5320 528.6995 533.9386 547.7657 560.0409 561.7287 576.4734 587.3194 609.2183 672.1728 751.0919 754.4207 862.1895 863.1911 873.3019 885.6633 891.1331 896.2131 933.2593 934.8354 954.6857 959.7540 1002.3426 1016.2820 1017.4714 1017.8279 1019.0103 1030.4709 1033.1904 1039.0875 1042.8047 1044.0327 1044.4310 1047.8062 1048.5900 1050.4104 1118.4410 1169.8975 1190.9249 1209.9718 1236.7451 1252.1310 1257.0374 1281.2795 1308.2566 1313.3716 1350.3521 1351.3370 1386.5977 1391.6906 1393.5720 1394.1529 1394.7749 1398.8156 1400.1492 1412.0371 1413.0553 1438.9573 1443.1429 1457.2785 1459.6023 1464.5004 1466.5062 1468.4934 1469.6738 1471.5540 1473.1688 1475.6590 1478.3319 1481.2507 1488.5262 1492.7667 1498.5832 1572.0596 1574.0251 1617.1869 1618.0215 1663.6218 2955.3669 2970.5075 2972.6390 2973.0674 2980.5329 2984.9550 2985.3438 3024.1558 3047.1737 3050.6706 3050.7085 3062.1789 3068.9120 3069.6454 3078.9990 3079.4108 3080.2959 3080.6524 3082.4619 3100.2149 3103.2290 3105.3037 3108.5432 3110.5036 3112.6712 3577.5479
redmass: 1.0124 3.6540 1.7853 1.4943 3.3776 3.8716 2.6416 1.8311 1.5467 1.7837 1.7935 2.2434 2.7033 1.9078 1.7573 1.7601 2.6878 2.2024 1.2017 1.7043 3.9307 1.8846 1.8492 1.7664 2.5515 2.9058 3.6536 3.6743 4.0554 3.4436 3.1831 2.9889 3.3502 3.4714 3.0120 4.2085 4.1050 4.3641 4.0368 3.8626 3.8864 3.0455 4.1895 4.4136 4.1278 4.0396 1.4388 1.5850 2.2846 4.0974 1.3116 1.3182 2.4531 2.3910 3.0265 3.5201 1.6306 1.7049 1.8190 1.7085 1.7312 1.5503 1.5978 1.5726 1.5382 1.5279 1.5571 1.5690 1.5395 1.6164 2.8410 2.0447 1.3818 3.3619 1.7121 1.5133 1.5643 3.2931 6.3900 6.3650 6.9168 7.1809 1.2292 1.2278 1.2329 1.2410 1.2453 1.2639 1.2696 2.4898 2.6239 1.8459 2.0530 1.1252 1.1467 1.0564 1.1290 1.0671 1.0466 1.0634 1.0883 1.1217 1.0885 1.1602 1.2396 1.1500 1.1951 6.1533 6.6035 5.7388 5.8644 6.6046 1.0405 1.0381 1.0385 1.0392 1.0359 1.0365 1.0364 1.0965 1.0942 1.0952 1.0974 1.0966 1.0968 1.0967 1.0996 1.0989 1.0997 1.0992 1.0985 1.0962 1.0907 1.0910 1.0914 1.0914 1.0949 1.0661
irintensity: 0.3932 0.1189 0.3616 0.1595 0.2592 1.4545 0.8107 5.7586 1.4609 0.7180 5.0385 0.6271 3.3618 3.7939 0.7701 1.0394 10.9261 1.6593 3.3358 0.7656 0.7919 27.7616 24.0161 17.8084 13.3922 0.0275 1.5077 7.3374 0.1881 7.6857 3.5969 3.4344 0.2716 0.1312 0.3772 0.8890 2.7014 0.0537 1.0627 2.7106 5.3343 5.4249 0.0363 2.5078 5.0098 4.1701 22.1877 34.2739 5.5719 57.7412 0.1506 0.9521 3.5873 0.8441 2.0219 1.5907 9.1180 6.9360 24.0548 1.0669 7.5825 1.4229 0.5080 7.1970 0.1389 1.1880 2.3852 24.9633 7.5462 29.7079 31.9814 14.7658 14.3507 107.4337 13.9700 1.7800 1.5701 48.5140 1.9134 0.2289 0.6492 1.0683 18.0230 24.5538 11.3967 12.7250 9.4150 4.8689 2.2750 0.5496 0.2171 0.1729 1.9564 10.5057 0.9454 9.9592 15.6012 14.9199 11.1836 11.9908 7.3583 17.8779 11.0385 49.4141 10.4682 16.7877 49.9395 12.3982 9.2340 26.4032 4.3753 62.6518 58.2322 56.5436 50.3889 35.3221 34.0461 34.5731 19.8846 21.8991 20.5801 22.1373 23.1062 16.0701 21.7432 9.0900 15.8483 17.9812 24.2401 29.8332 15.9799 8.4690 35.8392 34.9922 26.4892 23.9288 5.9654 34.6981
temp: 298.150 k
press: 1.00000 atm
elementType: 8 6 6 6 6 6 6 6 6 6 6 6 6 6 6 6 6 6 6 6 6 6 1 1 1 1 1 1 1 1 1 1 1 1 1 1 1 1 1 1 1 1 1 1 1 1 1 1
symmnumber: 1
zpe: 1063659.0 jmol-1
zpe.correction: 0.405126 hartree
zpe.thermalcorrener: 0.428484 hartree
zpe.thermalcorrenthalpy: 0.429428 hartree
zpe.thermalcorrgfe: 0.354141 hartree
zpe.sumelectzpe: -889.439902 hartree
zpe.sumelectthermal: -889.416545 hartree
zpe.sumelectthermalent: -889.415601 hartree
zpe.sumelectthermalfe: -889.490888 hartree
dipole: 1.3960 2.0665 -0.5084
dipole: 2.5452
quadrupole: -127.3708 -116.5802 -130.1793
quadrupole: 1.6120 3.5776 -1.4551
quadrupole: -2.6607 8.1299 -5.4692 1.6120 3.5776 -1.4551
hfenergy: -889.8450287 hartree
pointgroup: C01 [X(C21H26O1)]
dipole: 0.5863848 -0.8104366 -0.0453947 debye
polarizability: 283.7518608|5.4310662|230.2461421|-34.0716719|2.8084889|204.6104296 unknown
InChI: InChI=1S/C21H26O/c1-12-8-14(3)19(15(4)9-12)21(18(7)22)20-16(5)10-13(2)11-17(20)6/h8-11,22H,1-7H3
charge 0 multiplicity 1
48 atoms
O  -1.176609 -3.031156 -0.61679
C  1.296478 -0.194942 -0.195372
C  -1.293173 -0.281982 0.077673
C  0.012673 -0.98853 -0.190433
C  1.679867 0.57644 0.956779
C  -1.680587 0.862572 -0.697553
C  2.149154 -0.160972 -1.348823
C  -2.151108 -0.700519 1.149341
C  3.724727 1.367845 -0.197362
C  -3.725749 1.152899 0.669426
C  2.87331 1.332569 0.934088
C  -2.876743 1.551955 -0.389056
C  3.338908 0.612788 -1.323897
C  -3.336716 0.025505 1.424635
C  0.04966 -2.341584 -0.430041
C  0.853774 0.58535 2.232162
C  -0.862827 1.356544 -1.879891
C  1.838656 -0.898826 -2.644351
C  -1.852611 -1.897903 2.034415
C  4.998144 2.195965 -0.192851
C  -5.018637 1.894378 0.96338
C  1.273401 -3.225797 -0.499739
H  3.149967 1.904537 1.829604
H  -3.15448 2.421234 -0.999607
H  3.972199 0.629281 -2.220851
H  -3.970853 -0.304476 2.258232
H  1.397067 1.098662 3.044378
H  0.621389 -0.439671 2.571715
H  -0.11505 1.097201 2.091205
H  0.102873 1.791405 -1.56496
H  -1.417494 2.13048 -2.438449
H  -0.630445 0.535282 -2.580475
H  0.776769 -1.180496 -2.721272
H  2.09853 -0.270874 -3.515868
H  2.433176 -1.829685 -2.730044
H  -2.30171 -1.76893 3.035369
H  -2.271419 -2.816371 1.583039
H  -0.769122 -2.069816 2.154382
H  4.775493 3.275854 -0.096256
H  5.652607 1.924101 0.656736
H  5.575431 2.054331 -1.122884
H  -5.844407 1.526124 0.32321
H  -5.332608 1.759674 2.013625
H  -4.917049 2.977988 0.77278
H  2.186637 -2.659278 -0.266276
H  1.188123 -4.051047 0.237721
H  1.392771 -3.683091 -1.502088
H  -1.013687 -4.005718 -0.665101
