program: Gaussian 09
title: 000145206
version: EM64L-G09RevD.01
frameworkgroup: C1[X(C6H12N6S2)]
method: RPBEPBE
basis: SDD
operation: Freq
keyword: #p
keyword: freq=noraman
keyword: PBEPBE/SDD
title: #p freq=noraman PBEPBE/SDD
converged: YES YES NO NO
title: Mulliken charges:
elementType: S S N N N N N N C C C C C C H H H H H H H H H H H H
charge: 0.536788 0.536821 -0.116484 -0.116488 -0.505254 -0.505475 -0.504885 -0.504879 0.333316 0.333461 -0.603516 -0.604217 -0.603480 -0.604500 0.217865 0.283701 0.230370 0.284110 0.218204 0.230053 0.283677 0.230353 0.217874 0.218348 0.229909 0.284329
chargesum: 0.00000
title: Mulliken charges with hydrogens summed into heavy atoms:
elementType: S S N N N N N N C C C C C C
charge: 0.536788 0.536821 -0.116484 -0.116488 -0.505254 -0.505475 -0.504885 -0.504879 0.333316 0.333461 0.128419 0.128150 0.128423 0.128086
polarizability: 2.48927738e+02 3.39151743e-03 1.43953460e+02 9.88657943e-03 -7.52865380e-03 1.16676196e+02
1716.lowfreq: -8.3603 -7.1136 -6.1716 -0.0013 -0.0012 0.0024 41.2516 66.2369 75.7069
frequency: 41.2516 66.2328 75.7051 95.3248 103.1421 112.4274 112.9916 132.3803 150.1677 180.0886 192.2647 203.0162 221.3663 243.6206 269.1487 298.9163 315.1007 345.9962 384.9842 418.6230 441.5401 470.0290 494.4627 510.6586 586.5988 645.4169 655.6507 668.0801 734.2119 738.4087 835.7498 851.1689 1033.6332 1040.6680 1050.7897 1051.4774 1091.0538 1091.2100 1138.9164 1140.4274 1165.9885 1207.2183 1225.7167 1227.8486 1261.2212 1299.3959 1404.4103 1408.9210 1412.7870 1413.0977 1438.4341 1448.4495 1453.4562 1453.9736 1479.1659 1480.0506 1480.3970 1480.5423 1526.7918 1532.1813 2961.1308 2961.1951 2965.8805 2967.0417 3045.8358 3046.1270 3046.9970 3047.0402 3113.7824 3113.8689 3114.1204 3114.1422
redmass: 3.8639 2.4912 2.0387 1.7954 1.1903 1.1760 1.2246 1.9316 5.4343 18.8590 4.1515 3.9869 2.9324 3.3861 14.1764 4.7015 18.5729 3.0647 4.2145 4.6826 4.7955 15.1444 3.9511 4.3754 13.7722 11.3691 13.0064 11.6161 11.1903 10.9365 5.8740 5.6484 2.4851 2.4923 1.3816 1.3802 1.2333 1.2299 1.4095 1.3900 11.8165 3.0190 3.0392 7.9586 6.4284 8.9704 1.6942 1.4993 1.1213 1.1216 1.2504 1.2688 1.0532 1.0533 1.1139 1.0464 1.1196 1.0462 1.5947 1.8180 1.0383 1.0383 1.0388 1.0388 1.0973 1.0973 1.0976 1.0975 1.0986 1.0983 1.0981 1.0987
irintensity: 2.6456 0.0001 0.1243 0.2210 0.0002 0.1549 0.1823 0.3662 0.0000 2.3612 13.1720 0.0019 27.0547 4.8187 7.6800 11.2043 0.0000 0.0084 14.3778 20.5166 0.0000 46.5991 5.3110 12.8650 164.7175 3.3439 1.4194 43.1478 0.0018 7.0430 100.8766 18.1530 3.6257 0.8090 0.0189 10.3290 0.0068 2.4188 88.7549 14.9728 0.0002 488.2192 83.6235 2.2711 0.0005 55.0102 256.4854 17.1933 71.4237 0.1645 167.2170 107.9518 0.0730 16.7765 66.4300 0.2219 9.4764 21.4700 329.9282 141.7600 12.7736 45.3362 300.0786 21.6157 14.3832 85.4310 10.1854 22.1577 17.2648 9.3235 2.9557 5.2484
temp: 298.150 k
press: 1.00000 atm
elementType: 16 16 7 7 7 7 7 7 6 6 6 6 6 6 1 1 1 1 1 1 1 1 1 1 1 1
symmnumber: 1
zpe: 505602.3 jmol-1
zpe.correction: 0.192574 hartree
zpe.thermalcorrener: 0.209312 hartree
zpe.thermalcorrenthalpy: 0.210256 hartree
zpe.thermalcorrgfe: 0.147876 hartree
zpe.sumelectzpe: -1359.251670 hartree
zpe.sumelectthermal: -1359.234931 hartree
zpe.sumelectthermalent: -1359.233987 hartree
zpe.sumelectthermalfe: -1359.296367 hartree
dipole: 0.0009 -0.0006 3.4771
dipole: 3.4771
quadrupole: -76.7220 -103.2663 -94.0311
quadrupole: -0.0005 -0.0100 0.0002
quadrupole: 14.6178 -11.9265 -2.6913 -0.0005 -0.0100 0.0002
hfenergy: -1359.4442433 hartree
pointgroup: C01 [X(C6H12N6S2)]
dipole: 0.0003177 1.367878 -0.0175581 debye
dipolederiv: 1.070594 -0.0047173 0.0283694 0.0107089 0.5574301 -0.2705282 0.029324 0.1283103 0.3713965 1.0706298 0.0055784 0.0281988 -0.0097887 0.5610009 0.2656222 0.0294409 -0.1331955 0.3679237 -1.118528 0.3601223 -0.0331339 0.8379004 -0.6464449 0.0362852 -0.0400218 0.0186314 -0.4040261 -1.1188812 -0.3610529 -0.0238026 -0.8384746 -0.6477183 -0.0297806 -0.0187365 -0.0128272 -0.4025673 -0.8938389 -0.063922 -0.2911038 0.8017943 -0.6253194 0.2024705 0.2973231 -0.2739118 -0.4968766 -0.8937634 0.0564007 -0.2925266 -0.7940296 -0.6234958 -0.1992627 0.3180548 0.2770714 -0.4987568 -0.8893055 0.0850697 0.2596111 -0.8150648 -0.6267101 0.1377649 -0.3302417 -0.2682132 -0.4995414 -0.8892387 -0.078365 0.26175 0.8060322 -0.6232064 -0.1343764 -0.3511632 0.2714453 -0.5031105 1.4528858 -0.6351667 0.0546355 -1.5839854 0.8281609 -0.0701982 0.0672639 -0.0325068 0.2783377 1.4531618 0.6364615 0.038135 1.5854631 0.8305717 0.0558586 0.0262098 0.0181798 0.2758987 0.3240432 0.0282979 -0.1775442 -0.0459028 0.2730218 0.0592774 -0.4198032 0.1516909 0.1737038 0.2747319 0.0452659 0.1845729 -0.0300345 0.2676326 -0.0659519 0.4297781 -0.1531132 0.2267263 0.3243101 -0.0328349 -0.1766475 0.035031 0.2675959 -0.0615886 -0.4208388 -0.1539159 0.1790672 0.2743149 -0.0406607 0.1855542 0.040903 0.2733266 0.0654013 0.4293134 0.1528253 0.2204156 0.0068847 0.0642393 0.0544726 0.1431631 -0.1640827 -0.0240346 0.0290626 0.0520064 0.1013297 0.0889812 -0.0102851 -0.1029929 -0.0408601 0.1379119 0.0550905 -0.0791553 0.0037649 0.0230295 -0.2105134 -0.0415757 0.0899299 -0.132505 0.0102737 0.0124912 0.0832345 -0.0578851 0.0562454 0.0767327 -0.006385 0.1073329 -0.0337843 0.1362981 -0.061207 0.0844106 -0.0079485 0.0400299 0.0152648 0.0644992 -0.0630132 0.1384999 -0.1659663 0.0430849 -0.0413222 -0.0389464 0.0936727 -0.1980403 -0.0480314 -0.1090476 -0.1319052 0.0127749 -0.0206673 -0.0985109 0.0558988 0.0410673 0.0889584 0.0076611 -0.1032349 0.0388048 0.1362966 -0.0579842 -0.080165 -0.006653 0.0245585 -0.2104087 0.0439666 0.0886739 0.1348936 0.0112883 -0.0113645 0.0795384 0.059065 0.0550201 0.0067092 -0.0630109 0.0561401 -0.1424744 -0.1644731 0.0309185 0.032679 -0.045088 0.101926 0.0154722 -0.0654443 -0.061399 -0.1391761 -0.1664968 -0.037013 -0.0384566 0.0449107 0.0934932 -0.1990455 0.0450663 -0.1101089 0.1289489 0.0123183 0.0208075 -0.1009463 -0.055422 0.042493 0.077889 0.008823 0.1071785 0.0358423 0.1380114 0.0588847 0.0837286 0.0058266 0.038544 unknown
polarizability: 248.7617635|0.0649513|116.6810495|4.1702987|0.3650132|144.114581 unknown
InChI: InChI=1S/C6H12N6S2/c1-11(2)5-7-13-9-6(12(3)4)10-14-8-5/h1-4H3
charge 0 multiplicity 1
26 atoms
S  0.05918 -1.458549 -1.469029
S  -0.059258 -1.420028 1.506441
N  -2.950208 0.789653 -0.128003
N  2.949896 0.793074 0.107591
N  -1.434179 -0.573805 -1.286351
N  1.433637 -0.539684 1.300787
N  1.533378 -0.57325 -1.166638
N  -1.533874 -0.54342 1.181212
C  -1.891342 -0.095777 -0.074749
C  1.890674 -0.09306 0.077249
C  -3.656711 1.189462 1.097895
C  -3.556368 1.15989 -1.415143
C  3.657101 1.160086 -1.128128
C  3.556613 1.195803 1.384663
H  -3.91124 2.263556 1.039484
H  -3.004472 1.002754 1.964383
H  -4.590602 0.608211 1.235154
H  -2.841157 0.943329 -2.222973
H  -3.804111 2.237166 -1.406714
H  -4.482942 0.582501 -1.607539
H  3.004937 0.951555 -1.989668
H  4.590419 0.574456 -1.249783
H  3.912759 2.235057 -1.097614
H  3.801246 2.273301 1.350468
H  4.485121 0.625792 1.589382
H  2.8430 0.996529 2.198322
