program: Gaussian 09
title: 000145185
version: EM64L-G09RevD.01
frameworkgroup: C1[X(C14H24N4)]
method: RPBEPBE
basis: SDD
operation: Freq
keyword: #pfreq=noraman
keyword: PBEPBE/SDD
title: #p freq=noraman PBEPBE/SDD
converged: YES YES NO NO
title: Mulliken charges:
elementType: N N N N C C C C C C C C C C C C C C H H H H H H H H H H H H H H H H H H H H H H H H
charge: -0.338923 -0.354628 -0.453255 -0.429731 -0.435944 -0.416826 -0.358980 -0.376633 -0.367570 -0.359502 -0.362805 -0.356264 0.261752 0.235352 -0.370395 -0.335475 -0.265273 -0.284543 0.196816 0.208531 0.211003 0.195253 0.216047 0.198130 0.195484 0.209997 0.198014 0.204898 0.191991 0.212650 0.211370 0.194146 0.178595 0.220443 0.260396 0.268337 0.376041 0.359247 0.218416 0.228405 0.207307 0.208127
chargesum: 0.00000
title: Mulliken charges with hydrogens summed into heavy atoms:
elementType: N N N N C C C C C C C C C C C C C C
charge: -0.078527 -0.086291 -0.077214 -0.070484 -0.030597 -0.010570 0.055196 0.028847 0.035342 0.045139 0.042711 0.042774 0.261752 0.235352 -0.151979 -0.107070 -0.057966 -0.076416
polarizability: 2.36046899e+02 -2.55463831e+00 2.10239297e+02 5.67773304e+00 5.75832591e+00 1.15620484e+02
1716.lowfreq: -6.4153 -0.0007 -0.0004 0.0002 7.6891 8.6202 43.7329 56.4037 65.1511
frequency: 43.6579 56.3921 65.1043 114.3564 118.2733 127.3704 146.6449 163.1048 185.9069 195.9005 219.3905 247.9884 273.1405 292.9116 302.5653 307.2148 333.3585 345.0283 377.7312 459.1920 463.5734 482.1048 510.6755 545.0353 563.5583 590.9611 597.8453 617.6309 660.6999 716.1800 720.7441 726.0209 757.4836 804.6343 808.1528 819.8989 826.7266 854.8486 860.1463 874.2058 893.7836 905.2468 919.2586 929.4634 932.9860 939.6128 991.2310 993.5350 1035.8024 1050.8668 1051.9827 1078.3107 1088.1011 1098.4923 1135.6112 1141.0155 1144.5788 1145.8243 1160.0164 1168.5321 1173.8201 1215.7719 1226.2957 1233.7088 1246.4284 1255.1531 1268.8574 1272.7701 1287.3500 1305.4255 1325.3668 1335.2191 1343.6195 1349.3524 1352.8927 1358.5394 1359.8367 1367.5635 1383.7591 1400.1441 1433.7300 1443.8610 1447.3248 1452.1953 1459.0766 1462.5183 1475.0601 1479.9684 1484.4996 1492.0572 1493.3011 1501.2917 1520.8061 1548.2786 1608.2766 1610.4252 2854.1121 2869.8383 2879.8072 2881.0080 2891.2295 2895.2526 2954.3219 2969.0719 2978.4508 2991.2957 2993.6573 3005.5737 3017.0320 3021.5630 3042.6065 3046.7368 3116.3314 3130.3974 3143.6266 3158.9446 3263.4342 3333.8168 3417.2592 3441.9073
redmass: 3.5540 3.1871 3.7712 3.3918 2.9734 2.9611 3.7515 2.8939 2.7418 2.9358 4.2074 2.3272 2.7831 2.1561 4.1712 3.4887 2.6705 2.8705 2.8722 3.0636 2.2819 2.2434 2.8021 2.6563 3.9550 2.8289 4.6074 1.3252 1.5117 1.4984 2.9846 1.3489 2.0964 1.9096 1.7532 1.6182 2.1328 2.2545 1.6647 1.4264 1.5998 1.6334 1.7990 1.6781 1.3244 2.2556 2.3333 2.3994 1.7945 2.2226 2.0178 2.4124 2.3907 1.6812 2.7090 3.0563 2.4290 2.2821 2.0380 1.0752 1.2043 1.3338 1.3515 1.1986 1.2910 1.1437 1.2627 1.7800 1.2231 1.5896 2.2755 1.3028 1.4355 1.4836 1.3583 1.4303 1.3487 1.3663 1.4619 3.7235 1.1950 2.4852 1.2442 1.0913 1.1076 1.0911 1.0916 1.1100 1.1515 1.0963 1.1426 1.2989 2.2811 2.1664 3.6536 3.2499 1.0711 1.0685 1.0694 1.0707 1.0702 1.0714 1.0845 1.0822 1.0700 1.0692 1.0859 1.0877 1.0893 1.0916 1.0989 1.1004 1.0834 1.0883 1.0929 1.0999 1.0806 1.0815 1.0741 1.0749
irintensity: 0.1189 0.4472 2.9004 0.8644 1.4498 2.0580 2.1236 0.2780 0.6486 3.5389 3.6501 0.3992 2.5347 3.0028 2.5577 1.5473 1.0716 0.7365 1.5194 2.5466 3.6037 1.1297 1.6960 7.9010 1.2975 1.9663 5.4446 61.6397 24.7282 231.4987 13.5170 105.3071 39.5617 26.2780 3.6735 20.0663 29.1994 1.6266 24.6667 4.0845 5.5590 4.7334 6.9857 6.0526 1.0804 12.5264 4.4615 3.1860 7.6590 3.4225 19.9951 12.9372 5.9505 15.4275 22.4903 0.6601 26.1702 51.4883 31.0910 0.0136 10.2964 23.6344 2.3087 1.6622 19.1667 4.5079 27.6125 32.2545 20.3958 30.4907 62.8167 7.0262 4.4399 3.1535 1.5664 5.5996 5.9692 5.7004 7.2445 5.4123 13.3787 37.7689 21.2436 12.8792 11.6608 4.9698 6.9733 1.5948 22.6172 65.1677 32.8316 82.5337 46.4800 206.3788 129.9962 242.5097 110.0676 16.2605 28.2701 172.8578 71.0529 402.9809 28.1735 32.6781 50.3788 59.5198 1.6594 50.3167 46.0019 36.8374 62.0169 61.6219 0.8303 25.0597 59.8060 30.8455 288.2912 617.7974 0.1503 0.3035
temp: 298.150 k
press: 1.00000 atm
elementType: 7 7 7 7 6 6 6 6 6 6 6 6 6 6 6 6 6 6 1 1 1 1 1 1 1 1 1 1 1 1 1 1 1 1 1 1 1 1 1 1 1 1
symmnumber: 1
zpe: 970485.0 jmol-1
zpe.correction: 0.369638 hartree
zpe.thermalcorrener: 0.387079 hartree
zpe.thermalcorrenthalpy: 0.388023 hartree
zpe.thermalcorrgfe: 0.325137 hartree
zpe.sumelectzpe: -765.466595 hartree
zpe.sumelectthermal: -765.449154 hartree
zpe.sumelectthermalent: -765.448210 hartree
zpe.sumelectthermalfe: -765.511097 hartree
dipole: -7.4078 0.5206 0.3986
dipole: 7.4367
quadrupole: -109.8222 -95.6098 -110.9027
quadrupole: 0.6395 -0.6574 -1.1156
quadrupole: -4.3773 9.8351 -5.4578 0.6395 -0.6574 -1.1156
hfenergy: -765.8362333 hartree
pointgroup: C01 [X(C14H24N4)]
dipole: -2.9114467 0.2481021 0.1497261 debye
polarizability: 235.9250455|-3.0177758|210.2209066|6.1207409|6.461244|115.7607271 unknown
InChI: InChI=1S/C14H24N4/c1-2-6-14-13(5-1)17-9-3-7-15-11-12-16-8-4-10-18-14/h1-2,5-6,15-18H,3-4,7-12H2
charge 0 multiplicity 1
42 atoms
N  -2.324008 1.553991 -0.351551
N  -2.438385 -1.331341 0.778502
N  0.51177 1.43598 -0.032738
N  0.239831 -1.33716 -0.311386
C  -0.767807 3.506538 -0.50932
C  -1.438835 -3.108853 -0.716085
C  -2.077436 2.952127 0.095826
C  -2.320348 -2.795577 0.517294
C  -3.487849 0.884403 0.267409
C  -3.493872 -0.635794 0.008679
C  0.523557 2.891079 0.078624
C  0.054048 -2.777138 -0.510306
C  1.654608 0.638191 0.071592
C  1.523341 -0.79455 -0.090917
C  2.943686 1.182971 0.310734
C  2.692273 -1.595297 -0.068423
C  4.097906 0.360954 0.336631
C  3.975854 -1.027456 0.13385
H  -0.738568 4.600688 -0.343066
H  -0.781979 3.350116 -1.607695
H  -1.816328 -2.557796 -1.599667
H  -1.5347 -4.188335 -0.945245
H  -1.995806 2.940331 1.201102
H  -2.925588 3.63342 -0.158905
H  -3.323787 -3.267061 0.386522
H  -1.85738 -3.261514 1.408728
H  -4.462587 1.307411 -0.078357
H  -3.441204 1.067098 1.360216
H  -4.513865 -1.029286 0.243966
H  -3.324734 -0.826921 -1.069012
H  1.390894 3.31016 -0.475167
H  0.639367 3.224776 1.138158
H  0.440604 -3.375161 0.353834
H  0.631266 -3.108367 -1.39847
H  -2.3632 1.49653 -1.380392
H  -2.528995 -1.130843 1.783771
H  -0.426977 1.029004 -0.165353
H  -0.586262 -0.906881 0.144632
H  3.053323 2.261103 0.46987
H  2.605348 -2.678656 -0.202901
H  5.080347 0.813551 0.514067
H  4.860976 -1.673533 0.144146
