program: Gaussian 09
title: 000145183
version: EM64L-G09RevD.01
frameworkgroup: C1[X(C14H26O4)]
method: RPBEPBE
basis: SDD
operation: Freq
keyword: #pfreq=noraman
keyword: PBEPBE/SDD
title: #p freq=noraman PBEPBE/SDD
converged: NO YES NO NO
title: Mulliken charges:
elementType: O O O O C C C C C C C C C C C C C C H H H H H H H H H H H H H H H H H H H H H H H H H H
charge: -0.312764 -0.292055 -0.280623 -0.268251 -0.035658 0.045071 -0.457234 -0.435005 -0.395667 -0.399565 -0.244280 -0.239729 -0.417766 -0.418198 -0.259403 -0.224080 -0.265171 -0.232087 0.197800 0.159033 0.190246 0.217584 0.234150 0.189664 0.192429 0.226521 0.201637 0.186869 0.155574 0.291320 0.181653 0.176941 0.225924 0.195114 0.234858 0.178874 0.169774 0.203277 0.184771 0.179979 0.185389 0.194570 0.172016 0.206499
chargesum: 0.00000
title: Mulliken charges with hydrogens summed into heavy atoms:
elementType: O O O O C C C C C C C C C C C C C C
charge: -0.312764 -0.292055 -0.280623 -0.268251 0.162142 0.204104 -0.049404 -0.011191 0.023283 -0.011059 0.202613 0.118865 0.003272 -0.004467 0.113648 0.140670 0.114788 0.146428
polarizability: 1.86818798e+02 -2.67894226e+00 1.70140301e+02 -6.22338302e-02 1.26575532e+00 1.32796581e+02
1716.lowfreq: -10.0209 0.0004 0.0005 0.0006 2.5452 10.4595 20.8077 42.3144 66.9755
frequency: 16.8970 42.0392 66.8781 71.5083 93.7043 99.6671 112.3934 128.7334 153.0012 159.7055 173.0882 196.1665 239.5625 244.3722 260.0416 283.8584 313.5495 327.8111 337.9319 360.9739 367.8302 383.8400 428.4969 470.8247 476.2087 511.4745 532.0845 571.1242 657.5095 746.6461 757.5036 778.8072 808.8445 817.5381 834.7196 846.3640 879.5702 884.1476 902.9198 907.7504 921.6009 929.3738 943.6048 957.4014 979.7640 1019.9039 1022.7977 1025.3911 1038.1367 1043.5524 1059.8894 1065.0309 1072.0164 1094.6583 1097.6632 1106.6234 1107.8238 1111.7297 1120.5350 1130.3609 1141.3735 1184.3748 1189.6279 1198.9202 1205.8918 1218.6066 1236.7190 1240.7671 1244.6695 1249.8701 1262.2286 1270.4717 1288.9616 1300.8727 1310.8509 1321.5372 1328.9295 1333.5949 1334.8434 1343.2311 1344.9011 1350.3112 1356.5744 1359.4437 1385.6611 1386.1448 1401.8406 1407.2838 1431.5178 1453.0609 1454.0449 1455.1690 1455.6026 1456.2796 1466.6849 1472.6820 1478.6179 1484.6033 1486.9663 1504.6833 2879.6975 2900.1927 2903.0643 2913.7452 2918.5605 2934.0650 2943.1615 2944.3386 2947.1649 2955.1272 2958.2361 2979.5917 2981.4705 2989.0228 2992.0587 2992.5935 2996.8555 3001.6299 3004.9451 3029.3063 3048.4648 3055.9543 3057.4524 3061.1990 3062.5833 3077.4945
redmass: 3.2195 3.4093 2.4554 4.7903 3.9447 4.0508 3.3652 2.4956 3.3351 2.9615 3.5327 2.8003 2.6545 2.9133 3.6986 2.2164 2.3127 2.7561 3.0313 2.4528 2.9682 2.5318 2.7484 2.1185 2.8199 2.9807 2.8759 2.8665 2.7225 1.9365 2.1059 2.3565 1.9077 1.7136 2.7858 2.5076 2.1422 1.9034 2.1270 1.6207 1.7143 2.2104 2.2210 2.4541 2.8365 2.7328 3.0006 2.0833 2.5246 2.8924 2.0580 2.5165 3.8124 1.3912 2.5086 2.2452 2.3965 2.2000 2.5453 2.0280 1.9337 1.1318 1.1843 1.5232 1.1694 1.1889 1.3316 1.2800 1.1482 1.1366 1.1397 1.1371 1.3014 1.2546 1.2740 1.4484 1.3933 1.3637 1.2376 1.2675 1.4089 1.3891 1.4969 1.4259 1.3406 1.4208 1.4036 1.4642 1.0841 1.0891 1.0878 1.0927 1.0882 1.0837 1.0842 1.0921 1.0854 1.0846 1.0808 1.0791 1.0810 1.0562 1.0573 1.0588 1.0688 1.0570 1.0598 1.0810 1.1039 1.0966 1.0671 1.1009 1.0649 1.0870 1.0611 1.0638 1.0664 1.1031 1.0796 1.0953 1.0985 1.1020 1.0955 1.0980 1.1020 1.0982
irintensity: 0.2779 1.8017 1.7205 1.6021 3.8632 0.6705 2.8245 4.2568 9.8618 0.7658 5.8483 3.2017 0.2626 6.7876 1.8018 3.2083 0.7357 3.0351 6.4928 2.5487 2.1829 0.4817 4.6478 0.1185 4.2971 5.2113 1.8396 4.7670 1.2960 2.9280 4.9768 6.7224 10.7592 1.1554 14.0876 3.5626 5.5039 1.0792 3.3093 2.5903 21.0756 9.0006 19.1064 9.4754 8.8316 14.0259 61.5821 46.6036 16.9704 69.3526 75.0915 9.1939 205.4970 0.5540 34.0749 14.0006 31.2123 22.1023 8.9394 7.7638 16.6427 4.6548 1.4989 12.2325 6.3567 7.6897 0.6181 0.3963 1.8131 5.7124 0.4809 6.8393 1.5601 0.1291 1.7638 3.8476 3.0078 3.8481 28.0103 28.6857 2.3455 7.4579 2.3426 30.3554 1.8271 2.6521 0.1244 2.3466 17.0598 11.8977 1.4605 13.8058 8.4551 4.8575 8.6835 15.7401 6.5926 8.5782 3.9101 6.7273 57.2436 40.7288 93.7968 81.4979 40.0050 62.9013 131.5078 71.2872 43.2380 72.0111 40.7051 52.6200 63.1609 18.2065 51.4581 46.7672 74.2427 59.4605 93.0318 59.3988 41.3020 1.6832 19.3994 23.0260 83.6331 20.5153
temp: 298.150 k
press: 1.00000 atm
elementType: 8 8 8 8 6 6 6 6 6 6 6 6 6 6 6 6 6 6 1 1 1 1 1 1 1 1 1 1 1 1 1 1 1 1 1 1 1 1 1 1 1 1 1 1
symmnumber: 1
zpe: 1013358.6 jmol-1
zpe.correction: 0.385968 hartree
zpe.thermalcorrener: 0.404872 hartree
zpe.thermalcorrenthalpy: 0.405817 hartree
zpe.thermalcorrgfe: 0.338101 hartree
zpe.sumelectzpe: -848.442092 hartree
zpe.sumelectthermal: -848.423188 hartree
zpe.sumelectthermalent: -848.422244 hartree
zpe.sumelectthermalfe: -848.489959 hartree
dipole: -1.0092 2.4831 -0.4736
dipole: 2.7219
quadrupole: -98.5878 -101.2045 -110.2082
quadrupole: 2.1282 -0.7761 4.4096
quadrupole: 4.7457 2.1290 -6.8747 2.1282 -0.7761 4.4096
hfenergy: -848.8280602 hartree
pointgroup: C01 [X(C14H26O4)]
dipole: 0.6177752 0.8392654 0.2464533 debye
polarizability: 187.1010916|-1.5413083|169.871955|0.4055063|0.968331|132.782634 unknown
InChI: InChI=1S/C14H26O4/c1-2-6-14-13(5-1)17-9-3-7-15-11-12-16-8-4-10-18-14/h13-14H,1-12H2
charge 0 multiplicity 1
44 atoms
O  -1.690045 -1.2307 0.208866
O  -0.192114 1.315445 0.632716
O  2.217138 -2.374551 -0.851069
O  2.814665 0.349545 0.254288
C  -2.190784 -0.049649 0.927049
C  -1.641198 1.283636 0.359122
C  -3.726709 -0.080226 0.765834
C  -1.994434 1.428379 -1.135828
C  -4.135956 0.092318 -0.717149
C  -3.533959 1.383595 -1.321671
C  -0.321142 -1.652151 0.575507
C  0.426772 2.628098 0.44768
C  -0.039704 -2.960258 -0.170909
C  1.906939 2.55221 0.849011
C  1.442742 -3.348143 -0.062583
C  2.822007 1.771255 -0.108724
C  3.480994 -1.918942 -0.271454
C  3.665647 -0.449115 -0.63396
H  -1.901458 -0.119177 1.999459
H  -2.12789 2.115037 0.928704
H  -4.171181 0.729933 1.37933
H  -4.101371 -1.041655 1.161538
H  -1.524297 0.590994 -1.684483
H  -1.593307 2.375549 -1.544372
H  -5.239586 0.107864 -0.804402
H  -3.769304 -0.783135 -1.284796
H  -3.783109 1.454793 -2.397845
H  -3.989632 2.269162 -0.829162
H  -0.270585 -1.8065 1.678268
H  0.409557 -0.873744 0.298757
H  -0.09893 3.377234 1.085109
H  0.339915 2.96238 -0.610206
H  -0.292605 -2.825901 -1.238948
H  -0.675023 -3.77894 0.219947
H  1.994448 2.109677 1.858509
H  2.28159 3.593832 0.912024
H  1.774309 -3.331011 0.999118
H  1.616124 -4.367967 -0.464601
H  2.486265 1.898094 -1.163556
H  3.865002 2.158794 -0.035778
H  4.32634 -2.516784 -0.676935
H  3.473726 -2.018818 0.834543
H  4.733762 -0.154094 -0.509575
H  3.37778 -0.296362 -1.696767
