program: Gaussian 09
title: 000145176
version: EM64L-G09RevD.01
frameworkgroup: C1[X(C21H19ClN2O)]
method: RPBEPBE
basis: SDD
operation: Freq
keyword: #p
keyword: freq=noraman
keyword: PBEPBE/SDD
title: #p freq=noraman PBEPBE/SDD
converged: YES YES NO NO
title: Mulliken charges:
elementType: Cl O N N C C C C C C C C C C C C C C C C C C C C C H H H H H H H H H H H H H H H H H H H
charge: -0.034090 -0.261906 -0.099793 -0.112812 0.367962 -0.004856 0.487537 -0.504048 -0.389256 -0.395729 0.374327 -0.360974 0.510948 -0.795499 0.175762 -0.809518 -0.308199 -0.311019 -0.406237 -0.374727 -0.271294 -0.381118 -0.216487 -0.227800 -0.238504 0.275988 0.229593 0.229677 0.233791 0.230652 0.213312 0.241206 0.241042 0.230044 0.229502 0.229412 0.258081 0.283258 0.223751 0.299058 0.253452 0.228792 0.227141 0.229576
chargesum: 0.00000
title: Mulliken charges with hydrogens summed into heavy atoms:
elementType: Cl O N N C C C C C C C C C C C C C C C C C C C C C
charge: -0.034090 -0.261906 -0.099793 -0.112812 0.367962 -0.004856 0.487537 -0.228059 0.070015 -0.161937 0.374327 -0.130321 0.510948 -0.099940 0.175762 -0.120560 -0.308199 -0.052937 -0.122979 -0.150976 0.027764 -0.127666 0.012305 -0.000659 -0.008928
polarizability: 5.82798754e+02 1.34528894e+00 2.69872006e+02 -7.47576390e-01 8.95704456e-01 1.08568871e+02
1716.lowfreq: -3.3064 -0.0022 -0.0016 -0.0008 3.2900 6.3422 14.8298 16.1687 19.0606
frequency: 14.1148 15.3141 18.8623 33.5862 52.0789 53.1268 66.2877 94.2327 103.9731 110.9616 128.4404 136.7425 150.8877 165.3077 181.7779 200.9519 222.0644 258.2548 259.3672 302.7094 322.9677 345.5351 366.9557 390.2452 401.4631 418.9641 444.5563 450.6927 463.9826 468.6896 488.2527 530.1282 557.3134 566.2786 590.1576 608.8038 616.9409 649.0472 683.7863 703.0843 722.4448 725.4253 739.0729 741.3509 763.4171 807.3366 814.1838 820.8626 825.0990 857.4296 905.6376 914.3494 919.0848 922.2337 944.2460 950.4983 965.9856 981.7052 983.3605 989.3541 999.4746 999.6104 1012.3886 1021.5944 1021.6111 1029.3159 1044.6453 1050.6204 1085.7869 1102.2432 1140.0018 1160.6456 1169.3098 1173.4879 1188.6279 1205.5363 1213.0892 1216.7880 1234.8132 1253.5437 1270.1656 1277.0241 1313.0006 1348.1929 1355.4890 1367.5807 1380.9220 1391.5875 1393.6287 1398.1461 1399.9868 1426.2006 1440.4551 1458.8648 1459.6530 1466.9529 1471.6830 1476.8127 1480.4701 1488.1180 1497.1508 1551.9885 1576.3050 1596.4159 1606.7855 1614.5659 1620.5453 2944.3297 2976.4756 2989.4143 2999.1791 3054.3910 3074.5321 3086.9402 3088.6687 3109.7198 3116.8172 3129.1987 3141.8792 3142.8231 3151.8046 3156.8690 3160.4488 3173.7932 3176.2210 3177.7598
redmass: 5.0506 4.5508 4.9867 5.4155 1.1341 3.7427 6.2049 4.0550 1.1337 4.3672 6.3017 2.6723 6.3119 4.6210 6.9316 4.8563 3.8477 3.8509 4.9825 3.4400 3.5362 5.6922 10.2876 6.6500 2.8437 3.9937 3.2383 5.0575 2.8783 2.8382 6.0809 6.3112 5.0940 3.6141 6.1492 3.7191 6.4571 7.2499 7.8033 2.2949 3.6246 4.7584 3.0662 1.3760 6.0060 5.2117 1.4508 5.0890 1.3064 1.2513 5.7601 1.3077 1.4030 1.3940 2.5213 1.3658 1.3642 1.3727 8.0019 6.2942 1.3488 1.6812 1.5258 1.6754 2.5485 2.1736 1.5683 1.5492 1.5921 3.1082 1.2764 1.4440 2.2739 1.0529 1.1140 2.3452 2.2751 1.0849 2.9619 4.3590 1.9032 1.5169 1.4466 5.2875 1.9320 4.0874 5.4456 4.2189 2.9509 1.2655 1.3016 6.0410 2.1524 1.6157 1.0481 1.1004 1.0457 1.6290 1.1404 2.2603 3.1519 6.6183 5.9337 6.1818 7.5439 6.4475 5.9885 1.0549 1.0374 1.0362 1.1057 1.0977 1.0969 1.0986 1.1006 1.0881 1.0873 1.0867 1.0962 1.0929 1.0914 1.0878 1.0983 1.0918 1.0971 1.0960
irintensity: 0.4491 0.1117 0.0020 0.1895 0.8138 0.1524 0.1358 0.2188 1.6620 1.8259 0.0125 4.2768 1.0314 0.0736 0.4091 4.5531 1.7611 4.1698 0.2119 0.7887 0.0174 7.9976 1.8696 1.1896 0.0239 2.8467 2.3324 8.3418 18.7533 3.0371 11.6299 18.5108 9.2465 12.0304 22.8960 1.1099 1.7611 2.3389 21.6805 29.0545 2.6092 2.5758 12.6362 69.8036 18.0528 1.3864 40.3572 12.4036 38.1777 0.1312 22.4003 2.3367 7.6654 18.7445 5.9904 0.3794 1.3488 0.0462 130.3507 3.3419 0.0315 3.5983 6.4880 2.3378 75.3575 6.4401 4.3482 17.2078 11.5953 0.9711 68.1469 10.9342 38.6210 0.6283 15.3274 15.1965 14.1681 1.8744 22.0128 782.5182 1.0248 1.1171 11.9300 5.1749 5.0255 32.6118 14.0930 15.1906 25.8400 6.6157 17.3519 9.6617 26.8485 228.4723 13.2150 0.2506 13.2630 14.6788 39.3006 35.6772 43.6524 51.5424 12.9192 4.2568 158.8284 6.5063 8.7389 28.5061 44.5506 26.7991 24.5372 21.3893 14.2660 12.4833 31.5326 11.0427 9.4716 1.0830 46.5084 28.2654 9.8637 8.6903 34.2374 3.4219 9.5351 16.7120
temp: 298.150 k
press: 1.00000 atm
elementType: 17 8 7 7 6 6 6 6 6 6 6 6 6 6 6 6 6 6 6 6 6 6 6 6 6 1 1 1 1 1 1 1 1 1 1 1 1 1 1 1 1 1 1 1
symmnumber: 1
zpe: 898593.2 jmol-1
zpe.correction: 0.342256 hartree
zpe.thermalcorrener: 0.365641 hartree
zpe.thermalcorrenthalpy: 0.366585 hartree
zpe.thermalcorrgfe: 0.284953 hartree
zpe.sumelectzpe: -1454.619809 hartree
zpe.sumelectthermal: -1454.596425 hartree
zpe.sumelectthermalent: -1454.595480 hartree
zpe.sumelectthermalfe: -1454.677112 hartree
dipole: -0.1110 -2.9426 0.0170
dipole: 2.9447
quadrupole: -118.7179 -137.9997 -160.5359
quadrupole: -8.1859 -0.0986 0.2277
quadrupole: 20.3666 1.0848 -21.4514 -8.1859 -0.0986 0.2277
hfenergy: -1454.9620653 hartree
pointgroup: C01 [X(C21H19Cl1N2O1)]
dipole: 0.0497238 1.1568236 0.0384796 debye
polarizability: 582.737796|-0.4575977|269.7974779|5.6508687|3.4561408|108.704356 unknown
InChI: InChI=1S/C21H19ClN2O/c1-15-8-9-16(2)20(12-15)24-23-18-10-11-21(19(22)13-18)25-14-17-6-4-3-5-7-17/h3-13H,14H2,1-2H3
charge 0 multiplicity 1
44 atoms
Cl -1.797381 -2.69779 -0.240976
O  -3.206016 -0.114063 -0.200224
N  3.136745 -0.549512 -0.139947
N  2.410766 0.541486 -0.121295
C  5.354275 -1.520367 -0.140019
C  4.550886 -0.337058 -0.111574
C  6.553408 1.103058 -0.026784
C  5.154471 0.953082 -0.055967
C  -4.093153 1.058345 -0.176227
C  6.760617 -1.354086 -0.110262
C  -5.534449 0.578657 -0.189925
C  7.352398 -0.075001 -0.054912
C  -1.835178 0.10076 -0.181499
C  4.734895 -2.903324 -0.200451
C  1.002137 0.318157 -0.144818
C  7.203519 2.474779 0.034327
C  -1.00489 -1.059943 -0.197886
C  -1.213371 1.376202 -0.147462
C  -5.867686 -0.796127 -0.191001
C  -6.569061 1.548183 -0.198129
C  0.38483 -0.968692 -0.180345
C  0.190234 1.479118 -0.128995
C  -7.225163 -1.193363 -0.199613
C  -7.922769 1.148867 -0.206117
C  -8.255417 -0.22636 -0.206804
H  4.493679 1.825939 -0.035949
H  -3.882778 1.694314 -1.061537
H  -3.886571 1.6532 0.738293
H  7.399413 -2.244745 -0.130937
H  8.445763 0.015624 -0.033021
H  5.5179 -3.681211 -0.207892
H  4.069623 -3.083101 0.662433
H  4.111907 -3.024734 -1.104267
H  7.818013 2.587644 0.947487
H  7.872892 2.641151 -0.83066
H  6.448545 3.279124 0.035562
H  -1.819643 2.285637 -0.135249
H  -5.066199 -1.539675 -0.186235
H  -6.320257 2.617728 -0.198364
H  1.019009 -1.859375 -0.192351
H  0.683226 2.455689 -0.101841
H  -7.475737 -2.260128 -0.200805
H  -8.714469 1.906297 -0.212331
H  -9.305663 -0.538585 -0.21333
