program: Gaussian 09
title: 000145169
version: EM64L-G09RevD.01
frameworkgroup: C1[X(C8H10F4OS)]
method: RPBEPBE
basis: SDD
operation: Freq
keyword: #p
keyword: freq=noraman
keyword: PBEPBE/SDD
title: #p freq=noraman PBEPBE/SDD
converged: YES YES NO NO
title: Mulliken charges:
elementType: S F F F F O C C C C C C C C H H H H H H H H H H
charge: -0.016475 -0.126709 -0.193048 -0.165176 -0.171907 -0.174008 -0.186570 -0.045027 -0.659518 -0.680463 -0.291441 0.203627 0.187689 0.068019 0.231200 0.226063 0.232604 0.228211 0.232923 0.229088 0.226881 0.249391 0.230932 0.163713
chargesum: 0.00000
title: Mulliken charges with hydrogens summed into heavy atoms:
elementType: S F F F F O C C C C C C C C
charge: 0.147239 -0.126709 -0.193048 -0.165176 -0.171907 -0.174008 0.044630 -0.045027 0.027360 0.008428 -0.042050 0.203627 0.187689 0.298951
polarizability: 1.41679856e+02 1.92097311e+01 1.13317911e+02 -1.93363290e+00 1.30268821e+01 8.71997681e+01
1716.lowfreq: -5.1727 -0.0013 -0.0009 -0.0003 7.9899 10.5225 28.6034 39.0996 55.8094
frequency: 28.2436 38.9922 55.8022 73.6929 99.5273 140.5893 153.6924 177.8323 202.5888 217.0135 232.2082 240.9531 250.4057 273.8410 281.8049 336.1173 365.6753 379.9053 401.0935 439.5617 470.0901 521.6771 540.0995 583.1270 622.1572 662.6329 690.3426 769.3270 840.1686 876.5758 892.3916 922.3451 954.4457 958.9138 981.6777 990.3142 1011.9793 1033.7910 1100.5843 1123.1820 1163.7396 1186.2980 1219.5916 1290.6503 1297.7925 1309.5049 1337.9217 1367.8057 1376.7875 1397.8012 1462.3882 1467.0930 1479.1584 1486.9027 1558.2289 1583.7991 2437.8312 2985.7384 2987.7742 3005.6506 3076.5260 3083.8737 3087.7825 3091.2083 3095.2997 3098.6968
redmass: 6.5149 3.0183 10.2017 13.4015 9.8085 4.2003 4.9968 6.4902 1.3464 5.5233 5.0225 4.6677 1.2070 4.3526 4.4060 7.2755 6.6697 1.5288 2.8947 4.3793 9.7406 3.2923 8.9291 4.5928 5.1935 5.2328 5.2579 5.4740 1.8764 1.5288 1.7464 1.1876 6.3717 1.4745 7.5194 8.2196 1.7965 5.2524 2.5769 2.3547 4.7753 2.1418 6.2732 1.3451 1.1760 1.4079 1.3277 1.2325 1.1836 1.1950 1.0468 1.0466 1.0448 1.0560 11.3114 7.1644 1.0374 1.0351 1.0350 1.0847 1.0889 1.1000 1.1007 1.1002 1.0992 1.0873
irintensity: 0.2016 0.1247 1.7900 0.4283 1.7608 2.0263 0.9938 3.6625 1.8121 1.9802 0.1139 5.5505 0.6297 0.7635 5.3875 1.1232 4.3915 29.1861 15.2119 23.8427 9.5206 5.6607 12.8800 3.9305 11.7199 16.0309 7.1894 31.6312 30.5330 60.4203 15.1191 10.5389 73.3029 5.7185 116.0205 128.2969 18.4764 27.6046 2.8628 48.8178 106.5629 2.0087 12.2153 0.7128 7.2432 36.7662 6.2437 13.0462 17.3568 5.5842 6.9429 0.4106 17.6388 20.5782 65.9082 356.1681 24.3436 21.1589 20.6085 9.4573 6.2166 10.4758 25.3847 36.9205 24.5009 6.9820
temp: 298.150 k
press: 1.00000 atm
elementType: 16 9 9 9 9 8 6 6 6 6 6 6 6 6 1 1 1 1 1 1 1 1 1 1
symmnumber: 1
zpe: 435866.6 jmol-1
zpe.correction: 0.166013 hartree
zpe.thermalcorrener: 0.181903 hartree
zpe.thermalcorrenthalpy: 0.182848 hartree
zpe.thermalcorrgfe: 0.121641 hartree
zpe.sumelectzpe: -1182.364887 hartree
zpe.sumelectthermal: -1182.348997 hartree
zpe.sumelectthermalent: -1182.348052 hartree
zpe.sumelectthermalfe: -1182.409259 hartree
dipole: -6.3175 -1.5204 0.0836
dipole: 6.4984
quadrupole: -92.6419 -96.4569 -89.6669
quadrupole: -4.9421 -3.9025 0.4373
quadrupole: 0.2800 -3.5350 3.2550 -4.9421 -3.9025 0.4373
hfenergy: -1182.5308999 hartree
pointgroup: C01 [X(C8H10F4O1S1)]
dipole: 2.4394868 -0.7612186 0.0778189 debye
dipolederiv: -0.1053921 -0.2211248 0.1001392 -0.0343936 -0.1134684 0.1830895 -0.1171464 0.2261829 -0.4276359 -0.7607187 0.1633 -0.0395549 0.1433398 -0.2935483 -0.0141629 0.0207849 -0.0355446 -0.2152013 -0.5429385 0.0363892 -0.0306766 -0.0237785 -0.2818011 -0.0931031 -0.1713731 -0.0403857 -0.6106764 -0.5915586 -0.238197 0.2503274 -0.2815049 -0.4118534 0.1414405 0.1972167 0.1008441 -0.4141487 -0.3246109 -0.0698625 -0.1078949 -0.0981461 -0.2945189 -0.0953223 -0.0331189 -0.0886592 -0.6557029 -0.7314043 0.2274909 -0.0863815 0.3874139 -0.7366686 0.2172802 -0.2017721 0.3232039 -0.4377476 -0.0987355 0.0751368 -0.0199888 -0.0531102 0.0879413 -0.0068807 -0.1016651 0.0662944 0.0447279 0.6172711 -0.223953 -0.0848004 -0.4199818 0.2425015 -0.4239277 0.1407193 -0.5461355 0.7476114 -0.030146 -0.0245131 -0.0464853 0.0741135 -0.0019464 -0.0386676 0.1109391 -0.0470143 0.0293256 -0.0312628 0.043296 0.0292033 -0.0512609 -0.0103918 0.000586 0.0572608 -0.0454303 0.0651294 -1.0256158 0.4851056 -0.231118 0.3634738 -0.4233243 0.1421667 -0.0319467 0.0573828 -0.2180259 1.1233315 -0.1697821 0.1744048 -0.1820021 0.4436562 0.1874248 0.1978135 0.1464287 0.7663317 1.3016263 -0.4785423 0.1657518 -0.4566525 0.7879701 -0.3275793 -0.1134478 -0.3379541 0.271351 0.8304071 0.2433073 -0.1531079 0.4372179 0.7011011 -0.0722725 -0.1363325 0.0157545 1.01962 0.0206924 0.0225878 -0.0382791 0.0159715 0.0065432 0.0757235 -0.0129425 0.0497194 -0.1081066 -0.1587899 0.0191185 0.0836648 0.0177388 0.0969972 -0.0329702 0.0877675 -0.0186723 0.0289141 0.0949913 0.0579652 -0.0155643 0.0094151 -0.1407594 -0.0253775 -0.0136602 -0.0112899 0.0854124 0.0999379 -0.0239313 0.0034516 0.0056484 0.0550361 0.0888555 -0.0491113 0.0460678 -0.0822656 -0.0125538 -0.1120716 -0.0971789 -0.0655476 -0.0064505 -0.0459718 -0.0793669 -0.0584099 0.0424716 -0.1038209 0.0594561 0.1137888 0.0385701 0.0614265 -0.0044128 0.1211545 -0.0274331 0.0410526 0.1229085 -0.0038023 -0.0108749 -0.0101625 0.0560947 0.0302008 -0.0246463 0.0888252 -0.1029775 0.0478269 0.0154304 0.0402945 0.0629397 0.0594389 0.1010143 0.1173612 0.0405726 0.0345803 0.0130758 0.0522532 -0.0049494 0.0792705 0.0316629 0.0035167 0.0168392 0.0253741 0.0012374 0.2454792 0.0649432 0.0058285 0.0414277 0.0843618 0.0093499 0.0186733 0.0702786 0.094723 unknown
polarizability: 138.7984524|-22.6599745|101.7433773|2.6869747|-17.4762504|101.6557058 unknown
InChI: InChI=1S/C8H10F4OS/c1-4(2)5(14)3-6(13)8(11,12)7(9)10/h3-4,7,14H,1-2H3
charge 0 multiplicity 1
24 atoms
S  1.519654 -0.77036 1.489369
F  -2.951781 1.083546 0.24129
F  -1.300494 0.667003 1.753112
F  -2.809682 -1.585691 0.825048
F  -2.085929 -1.169713 -1.319275
O  -1.12034 2.305615 -1.173069
C  2.995928 -0.211801 -0.803828
C  1.641909 0.048719 -0.138853
C  4.13124 0.568384 -0.083293
C  3.328701 -1.724811 -0.894192
C  0.72266 0.862763 -0.769398
C  -1.676178 0.51391 0.351126
C  -0.662989 1.309059 -0.548445
C  -1.763361 -1.007087 0.061543
H  2.915754 0.178698 -1.836613
H  5.081193 0.426413 -0.629357
H  3.913175 1.650094 -0.042832
H  4.267561 0.20387 0.949991
H  2.53382 -2.285367 -1.417019
H  4.271186 -1.859404 -1.454107
H  3.468572 -2.170972 0.107241
H  1.102988 1.343061 -1.683459
H  -0.828526 -1.551543 0.278061
H  0.502938 0.004215 2.021459
