program: Gaussian 09
title: 000009963
version: EM64L-G09RevD.01
frameworkgroup: C1[X(C8H5F3O2)]
method: RPBEPBE
basis: SDD
operation: Freq
keyword: #pfreq=noraman
keyword: PBEPBE/SDD
title: #p freq=noraman PBEPBE/SDD
converged: NO YES YES YES
title: Mulliken charges:
elementType: F F F O O C C C C C C C C H H H H H
charge: -0.164341 -0.161868 -0.161881 -0.438039 -0.237300 0.312659 -0.433555 0.270774 -0.361458 0.264026 -0.314922 -0.191271 0.123317 0.300005 0.272544 0.284641 0.245371 0.391299
chargesum: 0.00000
title: Mulliken charges with hydrogens summed into heavy atoms:
elementType: F F F O O C C C C C C C C
charge: -0.164341 -0.161868 -0.161881 -0.046740 -0.237300 0.312659 -0.133550 0.270774 -0.088914 0.264026 -0.030281 0.054099 0.123317
polarizability: 1.24217305e+02 -6.40706554e+00 1.05969720e+02 5.60387221e-05 1.04260602e-03 4.37464630e+01
1716.lowfreq: -12.1523 -9.4885 -0.0014 -0.0013 -0.0006 5.2722 6.0793 57.8128 118.1514
frequency: -11.1410 57.8124 118.1506 118.9926 165.1169 223.9774 292.0050 300.5151 344.6001 389.6044 417.9627 438.7362 480.7857 531.3066 554.9902 594.0894 609.6175 619.1673 688.0933 695.6893 728.4974 803.8750 828.1567 948.1994 960.6650 989.9306 994.1475 1007.5718 1010.1515 1018.5202 1067.6324 1105.4540 1143.1635 1188.2284 1265.5402 1307.1350 1330.9438 1395.9673 1438.7950 1475.8117 1596.4804 1619.8248 1650.5126 3154.6796 3163.0686 3175.4080 3186.8573 3532.9725
redmass: 12.3288 9.9806 6.7611 11.3410 4.8719 7.7356 11.6251 6.1979 7.9801 9.3694 3.1611 8.0935 10.0109 7.6199 2.8452 5.0074 10.6179 1.5675 7.5920 2.5020 3.8330 7.5084 1.5535 1.5098 1.4551 6.3554 6.9770 6.6114 1.3901 5.5589 2.6286 1.8320 1.6328 1.1024 2.5003 1.4651 2.8421 10.1500 3.6635 2.5756 6.5694 6.3070 8.9604 1.0881 1.0931 1.0933 1.0985 1.0643
irintensity: 0.2115 0.4218 0.0217 0.3395 0.7185 1.9860 0.1861 0.0044 10.2708 8.1877 5.5375 4.6489 8.5408 5.6965 21.5471 65.5507 8.6929 119.8087 7.0257 6.4296 82.8898 37.9108 42.5192 51.4419 0.2064 2.8178 195.9002 111.7888 1.9997 103.8326 257.7166 10.4599 219.6578 1.5147 250.1482 36.2174 28.8929 4.4558 6.2906 7.9598 9.8437 39.1142 234.6295 4.8997 2.1165 0.8403 4.6354 53.4268
temp: 298.150 k
press: 1.00000 atm
elementType: 9 9 9 8 8 6 6 6 6 6 6 6 6 1 1 1 1 1
symmnumber: 1
zpe: 303429.2 jmol-1
zpe.correction: 0.115570 hartree
zpe.thermalcorrener: 0.125864 hartree
zpe.thermalcorrenthalpy: 0.126808 hartree
zpe.thermalcorrgfe: 0.078990 hartree
zpe.sumelectzpe: -756.908729 hartree
zpe.sumelectthermal: -756.898435 hartree
zpe.sumelectthermalent: -756.897491 hartree
zpe.sumelectthermalfe: -756.945309 hartree
dipole: 3.0196 3.6471 -0.0001
dipole: 4.7350
quadrupole: -69.2127 -71.3930 -75.7709
quadrupole: -0.8246 0.0018 0.0006
quadrupole: 2.9128 0.7325 -3.6454 -0.8246 0.0018 0.0006
hfenergy: -757.0242988 hartree
pointgroup: C01 [X(C8H5F3O2)]
dipole: -1.1780801 1.4430632 0.0011213 debye
dipolederiv: -0.7745799 -0.2183822 0.000095 -0.1498404 -0.4822969 -0.0000641 0.0001664 -0.0000199 -0.2885512 -0.4910692 0.1425084 -0.0800932 0.2267724 -0.5086425 0.2695064 -0.1057896 0.2339919 -0.6342342 -0.4909764 0.14223 0.0801248 0.2264454 -0.5081305 -0.2696064 0.1059632 -0.2340483 -0.6349737 -1.2531048 0.3060545 0.0004815 0.3784085 -0.4231544 -0.0001696 0.0001621 0.0000376 -0.4262342 -0.6963803 -0.1957453 0.0001104 -0.1067413 -1.0123929 0.0001087 0.0001135 -0.0003578 -0.321954 -0.3380059 0.0432514 0.0001097 0.048653 -0.206928 -0.0000348 0.000028 -0.0000012 -0.1660885 0.1005693 0.048711 -0.0000878 -0.0143562 -0.0049602 0.0000185 -0.000015 0.0000331 -0.061239 -0.4340043 -0.1559561 0.0001586 -0.2326 -0.2303979 0.000031 0.0002548 0.0000705 0.0134138 0.081826 0.055613 -0.0001167 -0.1087971 0.0557446 0.0000886 -0.0001435 -0.0000245 -0.0867925 1.9647721 -0.1883102 -0.0002753 -0.4019476 1.448668 0.0002049 -0.0004414 0.0001056 1.5599427 0.1119303 -0.0547298 -0.0001539 0.1449322 0.0514868 -0.0000533 -0.0000276 0.0001237 -0.0924211 -0.2964123 -0.0408057 0.0000879 -0.0149982 0.176641 0.0000848 0.0001044 0.0000813 -0.1421193 1.8866379 0.1756416 -0.0006496 0.1052131 1.3413688 0.0000363 -0.0005586 0.0001734 0.2392749 0.1424479 0.0027732 0.0000126 0.0293274 0.048881 -0.000043 0.0000152 -0.0000277 0.1563457 0.0339664 -0.0639164 0.0000723 -0.0580983 0.0809043 0.000023 0.0000865 0.0000371 0.1592061 0.0348714 0.0579286 0.0001042 0.0555284 0.1010491 -0.0000484 0.0001079 -0.0000459 0.1604373 0.0781995 0.0077017 0.0000494 0.0046158 -0.0861327 -0.0000611 0.0000376 -0.0000587 0.1598396 0.3393122 -0.0645676 -0.00003 -0.1325171 0.1582925 -0.0000213 -0.0000639 -0.0000702 0.4061476 unknown
polarizability: 124.3048458|6.2805326|105.8821509|-0.0433928|0.0136644|43.7464911 unknown
InChI: InChI=1S/C8H5F3O2/c9-8(10,11)6-3-1-2-5(4-6)7(12)13/h1-4,12H
charge 0 multiplicity 1
18 atoms
F  3.421075 0.45223 -0.001586
F  2.500049 -1.28729 1.12874
F  2.499034 -1.286058 -1.132974
O  -3.839489 0.000435 0.001758
O  -2.664091 -2.003647 0.000701
C  0.996374 0.254284 -0.000576
C  -0.177215 -0.529624 -0.000004
C  -1.438976 0.109786 0.000953
C  0.920909 1.666467 -0.000212
C  2.328161 -0.443254 -0.001563
C  -1.522468 1.526158 0.001329
C  -0.342578 2.297379 0.000735
C  -2.65599 -0.750882 0.001563
H  -0.136575 -1.623808 -0.000294
H  1.838863 2.26124 -0.000715
H  -2.506996 2.001049 0.002102
H  -0.402362 3.389934 0.001012
H  -4.617225 -0.619599 0.00163
