program: Gaussian 09
title: 000145154
version: EM64L-G09RevD.01
frameworkgroup: C1[X(C25H28N2O2)]
method: RPBEPBE
basis: SDD
operation: Freq
keyword: #p
keyword: freq=noraman
keyword: PBEPBE/SDD
title: #p freq=noraman PBEPBE/SDD
converged: YES YES NO NO
title: Mulliken charges:
elementType: O O N N C C C C C C C C C C C C C C C C C C C C C C C C C H H H H H H H H H H H H H H H H H H H H H H H H H H H H
charge: -0.278197 -0.259329 -0.118191 -0.118344 -0.207182 0.415849 -0.365108 -0.722036 0.176184 -0.481134 -0.695251 -0.334555 0.126860 -0.389939 -0.422392 0.445805 -0.436785 -0.377413 -0.222208 -0.220380 0.164633 -0.238595 -0.355648 -0.276445 0.342044 -0.334508 -0.345452 -0.246759 -0.683176 0.244403 0.195405 0.200693 0.223301 0.210877 0.215727 0.280450 0.210042 0.213574 0.226660 0.251592 0.248277 0.224991 0.223758 0.230843 0.253030 0.228161 0.227849 0.230105 0.246969 0.276195 0.247059 0.249798 0.211527 0.211479 0.233213 0.233228 0.208445
chargesum: 0.00000
title: Mulliken charges with hydrogens summed into heavy atoms:
elementType: O O N N C C C C C C C C C C C C C C C C C C C C C C C C C
charge: -0.278197 -0.259329 -0.118191 -0.118344 0.037221 0.415849 0.030990 -0.072132 0.176184 -0.200684 -0.044974 -0.082963 0.126860 -0.141663 0.026357 0.445805 -0.205942 -0.124383 0.005953 0.007469 0.164633 -0.008490 -0.108679 -0.000250 0.342044 -0.087448 -0.095654 0.176247 -0.008291
polarizability: 6.93368764e+02 7.70902324e+00 2.66667435e+02 -7.41590518e+00 -2.55824437e+01 1.72392240e+02
1716.lowfreq: -2.5288 -0.0014 0.0011 0.0017 3.4103 8.2943 11.8019 16.2978 21.6679
frequency: 11.7692 16.2775 21.6165 26.3389 28.0326 32.3026 54.5512 59.0525 75.6539 93.5366 108.3002 113.4268 120.6630 124.6761 128.1287 160.3305 168.1969 188.1659 209.2024 215.6527 221.7020 234.8693 246.4135 256.7768 271.5598 288.2141 318.4399 360.6801 368.3111 384.6278 401.5835 406.2014 415.4482 428.0796 430.4175 466.4625 491.6547 498.9141 508.0360 531.9174 545.4208 561.4765 592.2930 616.5087 627.1274 634.1224 640.0141 701.6663 714.0396 736.7761 741.5864 754.9765 756.8984 782.4968 799.9679 808.1468 817.0442 828.4635 832.5863 837.2961 852.2433 854.6297 867.5926 900.2057 913.7946 938.1278 945.8287 950.1903 955.1783 968.2720 968.9517 978.1700 988.1915 990.2068 992.1500 996.0859 1001.7217 1009.4362 1026.3388 1027.4566 1034.7175 1075.3679 1086.4881 1094.4818 1105.4732 1106.4717 1117.2495 1135.1094 1141.6463 1152.8091 1163.2245 1172.7332 1183.3966 1186.7569 1204.2260 1205.5692 1220.7308 1227.5048 1236.5222 1253.4648 1263.0596 1281.4743 1292.5825 1301.7588 1315.5291 1336.8189 1338.9740 1345.8645 1363.0130 1364.8332 1373.9027 1383.2738 1389.1112 1390.7489 1392.6458 1400.6184 1434.2637 1437.7580 1441.2244 1461.5020 1464.4607 1465.7309 1473.3624 1473.9864 1476.7757 1477.3963 1481.3213 1483.8714 1485.4842 1488.5235 1491.7297 1567.9047 1576.3506 1596.4218 1603.7145 1614.6458 1618.6780 2942.4194 2958.8572 2968.6037 2974.1300 2977.5872 2997.8479 3006.6227 3012.3444 3018.2015 3031.7909 3069.6949 3072.8221 3076.4092 3077.0440 3095.3282 3107.1109 3116.7624 3128.3018 3141.7366 3147.8407 3148.1116 3150.3347 3152.1267 3155.5695 3167.3169 3170.7295 3171.9605 3174.1870
redmass: 5.2963 3.6503 3.2925 3.8308 4.5916 4.3515 4.4136 4.3170 3.1807 4.1105 3.8795 3.0528 2.2739 3.9980 2.2457 4.2182 3.7439 3.9139 1.3198 5.6478 1.8646 1.6786 1.2426 2.6569 4.4454 3.5704 3.3553 4.3222 4.7338 3.7386 2.8256 4.7742 4.7882 3.6650 3.2388 3.2825 3.0031 5.0538 5.6937 2.5315 3.9591 4.5866 4.7930 6.4258 6.7391 3.6625 6.0709 2.0958 3.9845 3.7626 1.7441 3.0413 3.5383 5.4273 1.3835 1.2368 1.4907 3.5923 1.1329 2.4586 1.5950 1.2512 4.2251 3.3730 1.3560 1.7504 2.0419 1.3682 1.3829 1.3522 7.5721 1.3968 1.3333 6.0366 2.5784 1.3503 1.6871 1.7187 2.6010 2.1593 2.7665 2.2300 1.5547 1.9260 1.4793 1.7421 2.0444 1.4402 1.8261 1.7088 1.6424 1.0552 1.9075 1.1487 1.2190 2.5208 2.1433 3.3326 2.8384 1.3547 1.1407 1.6620 1.4169 1.2780 1.3695 1.4290 1.6075 6.6856 1.7458 1.6272 2.9189 1.5642 2.7637 3.2562 1.2585 1.2966 3.6744 3.9620 2.2049 1.0398 1.1876 1.2909 1.0638 1.3486 1.0782 1.0755 1.3624 1.8093 1.0661 1.8869 1.3393 6.9820 7.6505 6.1876 6.5703 6.5969 6.1087 1.0579 1.0554 1.0571 1.0358 1.0370 1.0363 1.1031 1.0938 1.1076 1.0920 1.0994 1.0995 1.0999 1.0995 1.0989 1.1015 1.0874 1.0867 1.0921 1.0902 1.0879 1.0875 1.0878 1.0958 1.1009 1.0956 1.0960 1.0968
irintensity: 0.4072 0.5436 0.1402 0.1054 0.2247 0.9063 0.5141 0.1188 0.4441 0.5850 0.8138 3.9011 1.0153 1.0507 0.3996 0.3828 6.5311 4.7756 1.4469 0.1006 1.7709 0.8233 1.4506 0.9230 0.6459 0.1385 2.0994 0.7550 0.3641 1.3132 1.1110 6.4672 1.0344 0.5270 2.3124 20.5700 2.0272 2.3030 20.2433 19.7082 37.6482 3.9534 32.8576 0.3456 10.1369 7.9606 1.4891 36.5429 3.0727 0.8572 70.7047 24.9106 9.5419 4.0240 4.9738 14.1404 41.7556 11.1239 1.7346 3.9519 67.0825 0.2362 0.6400 77.5406 12.0988 13.6578 6.8894 0.6232 4.1131 4.8537 185.6625 2.8077 0.4374 0.3542 7.3980 0.9874 11.6452 2.8398 9.2866 8.2769 117.9332 91.6770 8.7105 10.9778 10.7370 32.7320 6.9895 4.7154 134.4287 85.4454 88.5814 1.0640 29.7088 9.9256 22.2411 369.9726 24.3225 272.7328 552.2243 34.2555 0.0352 25.9391 4.8747 6.2920 11.4536 4.2100 7.8707 0.4678 7.9876 0.4157 47.9677 7.8703 1.3157 12.8999 24.7077 41.6634 5.1293 25.2119 12.3147 12.0839 39.1327 59.5003 38.7457 94.0552 9.6142 11.3853 10.0627 58.9878 8.4462 66.5311 21.4388 76.5930 4.8915 3.6090 185.3117 242.8813 1.5159 39.9876 46.2126 25.1194 53.8824 20.9781 36.8541 25.8176 9.9098 33.5309 15.9558 30.5134 30.9293 96.7505 42.6053 30.4024 34.0358 8.6588 0.1693 23.9518 1.9176 12.9165 13.4124 2.4689 41.1885 17.8239 18.2794 23.3953 16.0382
temp: 298.150 k
press: 1.00000 atm
elementType: 8 8 7 7 6 6 6 6 6 6 6 6 6 6 6 6 6 6 6 6 6 6 6 6 6 6 6 6 6 1 1 1 1 1 1 1 1 1 1 1 1 1 1 1 1 1 1 1 1 1 1 1 1 1 1 1 1
symmnumber: 1
zpe: 1228594.2 jmol-1
zpe.correction: 0.467947 hartree
zpe.thermalcorrener: 0.496402 hartree
zpe.thermalcorrenthalpy: 0.497347 hartree
zpe.thermalcorrgfe: 0.404156 hartree
zpe.sumelectzpe: -1227.256334 hartree
zpe.sumelectthermal: -1227.227879 hartree
zpe.sumelectthermalent: -1227.226935 hartree
zpe.sumelectthermalfe: -1227.320125 hartree
dipole: 0.0183 0.5393 -0.1551
dipole: 0.5615
quadrupole: -116.7330 -159.5445 -176.3033
quadrupole: 18.4483 -1.3416 -5.5811
quadrupole: 34.1272 -8.6842 -25.4431 18.4483 -1.3416 -5.5811
hfenergy: -1227.7242813 hartree
pointgroup: C01 [X(C25H28N2O2)]
dipole: -0.0017155 0.2127096 0.0596094 debye
polarizability: 691.7922078|-13.3862642|267.3714132|-26.2914331|25.5257548|173.2648172 unknown
InChI: InChI=1S/C25H28N2O2/c1-4-19(3)24-17-22(27-26-21-11-14-23(15-12-21)28-5-2)13-16-25(24)29-18-20-9-7-6-8-10-20/h6-17,19H,4-5,18H2,1-3H3
charge 0 multiplicity 1
57 atoms
O  3.723306 -0.261813 -0.02199
O  -8.22734 -0.496284 0.452711
N  -1.888282 -0.914124 0.153398
N  -2.61695 0.172566 0.266985
C  2.201651 2.111617 0.254763
C  1.544401 0.731805 0.156459
C  1.808331 3.02393 -0.945258
C  1.856564 2.797124 1.603574
C  2.333133 -0.456988 0.020372
C  0.14746 0.590468 0.200142
C  2.263607 2.476014 -2.314506
C  1.724775 -1.735833 -0.068188
C  -0.480393 -0.6856 0.114862
C  0.323242 -1.844866 -0.019462
C  4.58782 -1.453613 -0.105156
C  6.03282 -1.003417 -0.030856
C  7.018382 -1.673232 -0.796142
C  6.423984 0.050977 0.831218
C  8.379346 -1.305903 -0.692751
C  7.782284 0.425115 0.927273
C  -4.023995 -0.057943 0.308894
C  8.765189 -0.25463 0.169797
C  -4.83257 1.102134 0.418427
C  -4.651706 -1.340365 0.250776
C  -6.847758 -0.271257 0.410836
C  -6.237534 1.008927 0.469298
C  -6.045947 -1.442875 0.301845
C  -9.120347 0.67728 0.560596
C  -10.549747 0.143616 0.580041
H  3.296557 1.966986 0.213418
H  2.259501 4.022868 -0.777267
H  0.709392 3.172346 -0.947774
H  2.155266 2.16725 2.461035
H  2.380655 3.767522 1.687663
H  0.771082 2.990376 1.6902
H  -0.497907 1.468727 0.304792
H  1.992486 3.16957 -3.131651
H  3.360035 2.331786 -2.337474
H  1.791948 1.499634 -2.528525
H  2.327168 -2.641534 -0.178235
H  -0.173113 -2.818386 -0.085329
H  4.340226 -2.128948 0.741866
H  4.392531 -1.996467 -1.051764
H  6.724568 -2.481516 -1.477669
H  5.659342 0.58081 1.40841
H  9.132954 -1.831831 -1.289399
H  8.0748 1.245472 1.592319
H  9.818947 0.035538 0.247012
H  -4.332304 2.075324 0.462113
H  -4.01918 -2.228982 0.166438
H  -6.836314 1.920141 0.55255
H  -6.551051 -2.413037 0.259704
H  -8.950046 1.347183 -0.306878
H  -8.883244 1.233323 1.490627
H  -10.702431 -0.530183 1.440133
H  -10.768587 -0.417786 -0.344084
H  -11.265906 0.981584 0.659414
