program: Gaussian 09
title: 000145137
version: EM64L-G09RevD.01
frameworkgroup: C1[X(C21H17ClN2O2)]
method: RPBEPBE
basis: SDD
operation: Freq
keyword: #p
keyword: freq=noraman
keyword: PBEPBE/SDD
title: #p freq=noraman PBEPBE/SDD
converged: YES YES NO NO
title: Mulliken charges:
elementType: Cl O O N N C C C C C C C C C C C C C C C C C C C C C H H H H H H H H H H H H H H H H H
charge: -0.052091 -0.258699 -0.213258 -0.118568 -0.082778 0.245792 -0.466239 0.477709 0.240372 0.171178 -0.317079 -0.407796 0.401654 -0.366542 -0.015966 -0.380075 -0.393164 -0.372806 -0.274507 -0.224455 -0.224502 -0.786750 -0.101453 -0.226978 -0.215168 -0.206658 0.222799 0.222613 0.258677 0.312470 0.254292 0.236320 0.234934 0.263926 0.277691 0.232350 0.232429 0.248104 0.247554 0.216182 0.256063 0.234521 0.217905
chargesum: 0.00000
title: Mulliken charges with hydrogens summed into heavy atoms:
elementType: Cl O O N N C C C C C C C C C C C C C C C C C C C C C
charge: -0.052091 -0.258699 -0.213258 -0.118568 -0.082778 0.245792 -0.020828 0.477709 0.240372 0.171178 -0.058402 -0.095327 0.401654 -0.112250 -0.015966 -0.143755 -0.158230 -0.108880 0.003184 0.007894 0.007927 -0.074910 -0.101453 0.007543 0.040895 0.011247
polarizability: 6.19645059e+02 -1.66642761e+01 2.32138986e+02 1.40519754e+00 1.53583293e+00 1.45593311e+02
1716.lowfreq: -7.8968 -4.1866 -0.0018 -0.0014 -0.0011 1.8604 5.1412 12.5627 15.3548
frequency: -7.2519 12.2916 15.3351 28.0970 38.2932 56.0855 73.1486 95.7848 103.2414 117.1691 134.1243 136.0980 165.1652 167.5050 180.2129 193.7937 216.1880 228.0920 256.3661 269.7765 336.8602 345.1780 349.3278 377.3117 400.7189 402.7144 424.6378 452.7840 460.3175 462.2858 494.3746 530.2624 548.4733 549.1798 576.3366 593.6672 598.8907 617.1875 640.4647 664.0388 701.7977 729.7071 737.4130 748.2692 757.2214 791.1710 826.7211 837.3926 839.1693 844.0331 853.0685 872.5526 875.4337 912.6265 936.3460 959.1721 964.5461 976.1530 976.7524 977.6348 977.7721 991.0864 994.8891 1000.8809 1008.2071 1026.5827 1043.2347 1077.6144 1083.6137 1090.9749 1103.9954 1152.4707 1175.0446 1179.3933 1188.2084 1194.2697 1197.6570 1203.8583 1225.7787 1232.6211 1259.6326 1275.5316 1327.2287 1347.0647 1351.8749 1369.7471 1375.0296 1388.0869 1388.7387 1397.5104 1404.0054 1431.6901 1442.4319 1454.1986 1457.5138 1465.4477 1473.7966 1481.2672 1487.7114 1568.5433 1571.0790 1580.0352 1587.9583 1597.7746 1617.4471 1617.9430 2963.9959 2976.9186 2995.2664 3042.3079 3080.4953 3096.8425 3124.4889 3125.5299 3138.5933 3152.0010 3152.0630 3156.2676 3161.0063 3163.5536 3167.8977 3175.4857 3177.3065
redmass: 3.8323 5.4974 5.5621 7.2715 6.6956 6.5249 5.4243 2.4266 1.4207 7.6345 7.8624 5.1446 3.8261 6.2558 5.5252 3.3776 4.4921 5.0744 5.3495 5.8991 2.9778 5.1467 4.4757 7.9050 3.3492 3.9474 4.8679 3.0599 5.8391 3.2519 4.5662 4.8806 3.5713 5.6906 5.3654 3.2591 6.8294 6.3401 6.6437 6.4534 1.8737 3.5435 3.2164 3.7187 2.9208 4.3989 1.4551 1.4474 5.5836 3.5506 1.2479 7.2005 1.3354 3.7445 1.9513 1.4795 1.4214 3.0346 1.4133 1.4041 1.4568 6.0491 1.5248 1.3344 1.7301 2.1795 1.5606 1.9920 2.4598 1.5090 2.0023 1.6431 1.0545 1.9049 1.1334 2.5531 1.0914 2.8930 2.5416 3.4721 1.3492 1.9276 1.2701 1.7074 5.6170 2.2113 3.5798 8.0442 2.8299 2.1182 1.5880 4.2998 2.1821 2.6456 1.0469 2.2336 1.1689 1.2608 2.3450 7.3069 7.3850 7.3454 6.6046 6.1089 6.2758 6.4353 1.0872 1.0560 1.0364 1.1081 1.0966 1.1009 1.0864 1.0884 1.0916 1.0887 1.0962 1.0877 1.0927 1.0908 1.1016 1.0973 1.0952
irintensity: 0.0405 0.2524 0.8687 0.0906 0.0591 0.0743 0.2225 0.0838 0.9882 0.5899 2.2099 1.2898 16.2840 2.1347 3.6035 1.0279 0.0012 0.2341 5.2941 5.7968 0.9263 1.7322 3.0782 42.1017 1.8899 3.2964 9.0023 2.4804 6.9632 5.3524 0.3187 16.4678 1.3434 5.5150 14.5820 13.1351 12.5443 0.1102 20.1973 51.2471 47.4476 0.0005 34.5764 6.0201 42.3182 10.6774 17.6048 56.2655 34.5765 25.8217 0.0138 42.2398 17.4191 259.1867 34.4408 8.0854 0.8018 4.0845 2.3300 0.0131 0.2561 2.1528 5.5403 0.0290 9.6753 5.3723 9.0893 3.5018 214.5783 6.9184 29.4050 44.3125 0.0080 31.3636 23.0205 106.0193 1.6888 6.8572 309.6230 358.0143 8.3104 14.2609 0.4617 35.4233 0.6614 33.3325 1.3080 2.6291 46.4487 16.9668 6.1255 40.5496 9.8189 20.4464 13.9562 156.4131 57.8344 3.8751 10.3664 68.6275 125.8016 215.1726 109.5524 0.7889 30.9380 171.8067 76.0212 38.2987 17.8138 19.6225 10.4233 28.0626 7.1395 3.2860 12.3092 5.9002 33.5336 0.1667 5.6564 1.7507 25.3265 9.4875 20.6685
temp: 298.150 k
press: 1.00000 atm
elementType: 17 8 8 7 7 6 6 6 6 6 6 6 6 6 6 6 6 6 6 6 6 6 6 6 6 6 1 1 1 1 1 1 1 1 1 1 1 1 1 1 1 1 1
symmnumber: 1
zpe: 850224.4 jmol-1
zpe.correction: 0.323833 hartree
zpe.thermalcorrener: 0.346599 hartree
zpe.thermalcorrenthalpy: 0.347543 hartree
zpe.thermalcorrgfe: 0.268115 hartree
zpe.sumelectzpe: -1528.579036 hartree
zpe.sumelectthermal: -1528.556270 hartree
zpe.sumelectthermalent: -1528.555326 hartree
zpe.sumelectthermalfe: -1528.634754 hartree
dipole: -5.3736 -4.0651 0.0709
dipole: 6.7384
quadrupole: -138.2614 -159.9014 -154.2469
quadrupole: 11.2079 -0.0246 0.6699
quadrupole: 12.5418 -9.0982 -3.4437 11.2079 -0.0246 0.6699
hfenergy: -1528.9028694 hartree
pointgroup: C01 [X(C21H17Cl1N2O2)]
dipole: 2.0992017 1.5607399 0.4310039 debye
polarizability: 619.8825775|-13.7460288|227.8839063|0.8817347|18.188239|149.6108722 unknown
InChI: InChI=1S/C21H17ClN2O2/c1-15-11-18(22)7-9-20(15)24-23-19-8-10-21(17(12-19)13-25)26-14-16-5-3-2-4-6-16/h2-13H,14H2,1H3
charge 0 multiplicity 1
43 atoms
Cl -9.099194 0.519692 0.048006
O  3.260138 0.091991 0.080955
O  0.988335 -3.173565 -0.775671
N  -2.350163 0.816692 0.199271
N  -3.098407 -0.223338 -0.075593
C  1.88535 0.311762 0.121515
C  4.169825 1.238946 0.389437
C  5.58875 0.739861 0.27939
C  1.05874 -0.825097 -0.177651
C  -0.945197 0.562168 0.151192
C  1.288016 1.561556 0.432981
C  -0.343525 -0.684703 -0.158785
C  -5.33876 -1.108719 -0.326807
C  -0.113135 1.676191 0.445121
C  -4.506069 0.019172 -0.030241
C  6.219906 0.12261 1.388591
C  6.302902 0.872246 -0.937412
C  -6.743186 -0.930958 -0.296965
C  -5.084251 1.2827 0.284425
C  7.543383 -0.358335 1.282469
C  7.627367 0.393382 -1.046322
C  -4.746214 -2.462239 -0.664117
C  -7.287063 0.328124 0.018044
C  8.249704 -0.222673 0.064254
C  -6.478537 1.44761 0.311227
C  1.66734 -2.1437 -0.505455
H  3.939658 1.596848 1.411995
H  3.966842 2.050235 -0.336307
H  1.899161 2.437637 0.663653
H  -0.965311 -1.556231 -0.387829
H  -0.595911 2.630106 0.682134
H  5.671815 0.013937 2.332305
H  5.819653 1.345347 -1.800871
H  -7.405004 -1.773175 -0.518993
H  -4.414371 2.119294 0.504335
H  8.02295 -0.834873 2.144299
H  8.171648 0.499722 -1.990907
H  -4.077482 -2.396937 -1.53991
H  -4.127783 -2.844128 0.167084
H  -5.540027 -3.197405 -0.879175
H  -6.932817 2.413008 0.551558
H  9.277378 -0.593457 -0.018398
H  2.778844 -2.175105 -0.499828
