program: Gaussian 09
title: 000145131
version: EM64L-G09RevD.01
frameworkgroup: C1[X(C12H14N2)]
method: RPBEPBE
basis: SDD
operation: Freq
keyword: #pfreq=noraman
keyword: PBEPBE/SDD
title: #p freq=noraman PBEPBE/SDD
converged: YES YES NO NO
title: Mulliken charges:
elementType: N N C C C C C C C C C C C C H H H H H H H H H H H H H H
charge: -0.076247 -0.037518 0.084051 -0.498934 -0.498606 -0.266672 -0.446738 -0.447179 0.403100 -0.389248 -0.419468 -0.255694 -0.222306 -0.242688 0.255940 0.220918 0.220586 0.255953 0.253354 0.212954 0.245073 0.245218 0.212949 0.217317 0.299026 0.222618 0.224991 0.227251
chargesum: 0.00000
title: Mulliken charges with hydrogens summed into heavy atoms:
elementType: N N C C C C C C C C C C C C
charge: -0.076247 -0.037518 0.084051 -0.022077 -0.022068 -0.013318 0.011289 0.010989 0.403100 -0.171930 -0.120442 -0.033077 0.002684 -0.015437
polarizability: 1.79206915e+02 1.30116002e+00 1.25924739e+02 -2.97565724e-03 -5.11316272e-02 8.78723499e+01
1716.lowfreq: -0.0002 0.0003 0.0007 3.9771 11.0353 14.8611 30.7305 95.2654 107.9125
frequency: 27.8202 95.1377 107.8205 143.2680 233.4407 265.0137 289.9290 323.2865 354.3935 402.7441 415.8191 436.2766 530.7834 577.7761 618.2669 628.2164 661.0065 677.2630 708.5987 766.8226 768.9198 785.7145 786.2901 858.0275 859.7155 885.6062 913.7392 918.5024 932.4656 948.3550 982.3205 989.5531 1000.1482 1007.7803 1032.3440 1041.5979 1046.4282 1076.3421 1086.1197 1095.2284 1146.2905 1171.2476 1187.6593 1198.0800 1205.6430 1231.5144 1238.7871 1252.2955 1270.4679 1282.4046 1314.3485 1317.1801 1330.1637 1331.7294 1375.8517 1431.2461 1447.3170 1456.4846 1460.2687 1468.6510 1482.4452 1483.7014 1588.6522 1613.0527 2999.8158 3000.6518 3015.4150 3017.3823 3055.1841 3057.2430 3079.1666 3082.6746 3085.9028 3112.1193 3125.3206 3138.5591 3157.2608 3175.0773
redmass: 3.8305 3.0666 1.9965 3.4000 1.8279 4.2434 5.4196 2.7929 4.3904 2.8622 3.9278 6.8536 3.1854 4.8541 6.3222 7.4170 4.7238 6.1406 1.7673 1.8600 3.2604 2.0946 1.3597 1.2532 4.4750 2.2378 2.0253 3.0143 1.6658 1.8366 1.3549 6.2416 6.6229 1.3223 2.1841 2.4381 3.3246 1.7259 2.0256 1.9471 1.2826 1.0526 1.1251 1.1997 1.3173 1.8668 1.2395 1.5184 1.3726 1.3819 1.4840 1.4013 1.3490 1.5712 7.5380 2.4144 3.8893 1.0758 1.0834 1.0881 1.8469 1.3341 6.2012 6.1222 1.0597 1.0599 1.0621 1.0621 1.1034 1.1033 1.1040 1.0963 1.0965 1.0863 1.0871 1.0934 1.0987 1.0956
irintensity: 1.7984 0.1911 0.1433 3.8222 0.1605 0.5053 0.4713 0.9648 6.6786 0.0050 0.9421 0.1379 18.0761 1.4488 0.4575 2.3351 0.2278 0.5797 52.6311 49.7303 6.6777 3.7073 3.0761 0.2691 0.9146 0.4349 7.2259 0.2406 0.1640 0.3294 0.1821 0.1359 17.0679 1.0113 3.2937 6.0394 0.4871 7.0749 0.0707 8.5817 3.9959 0.6725 3.3874 2.3220 1.3886 0.7719 0.6860 3.8138 3.6641 0.7310 14.9836 11.3214 2.0024 13.6871 0.6370 2.8759 10.3510 0.1292 3.3905 10.3457 20.9427 13.5794 1.5633 11.3192 69.6096 5.8966 38.6551 24.3788 2.2171 1.5998 29.2915 37.7773 43.2099 12.8998 2.3699 37.6726 28.1259 9.8642
temp: 298.150 k
press: 1.00000 atm
elementType: 7 7 6 6 6 6 6 6 6 6 6 6 6 6 1 1 1 1 1 1 1 1 1 1 1 1 1 1
symmnumber: 1
zpe: 614079.9 jmol-1
zpe.correction: 0.233891 hartree
zpe.thermalcorrener: 0.245086 hartree
zpe.thermalcorrenthalpy: 0.246030 hartree
zpe.thermalcorrgfe: 0.196274 hartree
zpe.sumelectzpe: -574.112594 hartree
zpe.sumelectthermal: -574.101399 hartree
zpe.sumelectthermalent: -574.100454 hartree
zpe.sumelectthermalfe: -574.150210 hartree
dipole: -0.6627 -3.7458 0.0264
dipole: 3.8040
quadrupole: -75.1691 -85.0980 -83.5299
quadrupole: 7.0409 -0.0425 0.0543
quadrupole: 6.0965 -3.8323 -2.2642 7.0409 -0.0425 0.0543
hfenergy: -574.3464842 hartree
pointgroup: C01 [X(C12H14N2)]
dipole: 0.230542 -1.4786492 0.0183422 debye
polarizability: 179.1314284|-2.3882407|125.9878757|0.079053|-0.687599|87.8846996 unknown
InChI: InChI=1S/C12H14N2/c1-2-4-10(5-3-1)12-8-6-11(7-9-12)13-14-12/h1-5,11H,6-9H2
charge 0 multiplicity 1
28 atoms
N  1.081335 1.361661 -0.014673
N  2.371257 1.445555 -0.015403
C  0.517083 -0.062549 0.003356
C  1.091358 -0.789727 -1.26236
C  1.090607 -0.757752 1.287376
C  3.088784 0.102369 0.002292
C  2.645924 -0.689264 -1.260329
C  2.6450 -0.655918 1.284836
C  -1.010713 -0.010035 0.002172
C  -1.757505 -1.217616 0.023306
C  -1.711505 1.222276 -0.020373
C  -3.169419 -1.196523 0.022173
C  -3.124759 1.243444 -0.021624
C  -3.860575 0.0370 -0.000341
H  0.659257 -0.319427 -2.162481
H  0.75139 -1.840567 -1.249969
H  0.751771 -1.808896 1.300152
H  0.656864 -0.265879 2.17509
H  4.168129 0.316095 -0.000112
H  3.120642 -1.687316 -1.240026
H  3.008731 -0.170022 -2.164446
H  3.00616 -0.112471 2.175301
H  3.120799 -1.653587 1.291709
H  -1.240238 -2.185205 0.040835
H  -1.134672 2.150485 -0.036588
H  -3.728445 -2.139147 0.038851
H  -3.651582 2.20453 -0.03937
H  -4.956277 0.055987 -0.001255
