program: Gaussian 09
title: 000145112
version: EM64L-G09RevD.01
frameworkgroup: C1[X(C9H18)]
method: RPBEPBE
basis: SDD
operation: Freq
keyword: #p
keyword: freq=noraman
keyword: PBEPBE/SDD
title: #p freq=noraman PBEPBE/SDD
converged: YES YES NO NO
title: Mulliken charges:
elementType: C C C C C C C C C H H H H H H H H H H H H H H H H H H
charge: -0.018851 -0.376274 -0.478770 -0.712890 -0.706944 -0.176605 -0.172893 -0.438235 -0.669288 0.214142 0.189078 0.192710 0.205869 0.201588 0.209805 0.220492 0.202946 0.211373 0.210320 0.202467 0.219699 0.216669 0.202333 0.205989 0.214147 0.220738 0.210386
chargesum: 0.00000
title: Mulliken charges with hydrogens summed into heavy atoms:
elementType: C C C C C C C C C
charge: 0.195290 0.005514 -0.071312 -0.079647 -0.082784 0.043094 0.043776 -0.029913 -0.024018
polarizability: 1.18404524e+02 -8.10725389e+00 9.11619453e+01 4.00163272e+00 -2.52454683e+00 8.67906559e+01
1716.lowfreq: -21.0771 -5.5795 -0.0006 -0.0005 0.0005 3.5252 28.6232 34.1810 71.1478
frequency: 28.2791 33.7952 71.0394 109.3433 157.6591 174.5395 196.3779 223.9502 235.4654 274.3285 320.3291 373.5282 400.1729 404.3955 471.0297 499.6989 743.2305 770.9870 810.6640 838.1753 884.7800 904.7298 912.4352 948.6304 951.3130 977.7612 995.1669 1025.2668 1064.5891 1069.8437 1111.8073 1122.2181 1157.6460 1176.7214 1199.4146 1233.8401 1244.0027 1276.7861 1288.0159 1296.5996 1311.7813 1336.5998 1344.6948 1347.7260 1372.8728 1385.0513 1390.4635 1452.6321 1460.1165 1464.7826 1468.0048 1471.3263 1474.2936 1480.0914 1483.9489 1486.6630 1684.3677 2949.1982 2962.0276 2962.3451 2963.1525 2967.2419 2970.4793 2975.7399 3008.0919 3022.8954 3027.7352 3054.4680 3056.3822 3062.5488 3064.8122 3065.7666 3071.2225 3073.2369 3080.8264
redmass: 2.4734 2.9172 2.2234 2.4900 1.5324 2.3855 1.1161 1.1325 1.4001 1.8796 2.4967 2.1125 2.3587 1.9884 2.4470 2.3800 1.8731 1.2892 1.7030 1.6089 1.8340 1.8698 1.1933 1.4796 1.5786 1.1280 1.8348 2.2171 1.8879 1.5217 2.3098 1.9039 2.1115 1.8454 1.4096 1.3845 1.2335 1.2263 1.2591 1.2748 1.3929 1.4138 1.4326 1.5074 1.2203 1.2028 1.2182 1.0766 1.0846 1.0733 1.0571 1.0552 1.0433 1.0567 1.0642 1.0512 6.6244 1.0604 1.0561 1.0562 1.0434 1.0588 1.0639 1.0355 1.1003 1.0967 1.0964 1.0990 1.0941 1.0985 1.0967 1.0929 1.0987 1.0972 1.1006
irintensity: 0.0054 0.0899 0.0334 0.3948 0.5545 0.6512 0.2254 0.1709 0.1790 0.4911 0.3407 0.1929 1.1806 0.6631 0.2051 2.1392 3.3109 5.8983 0.9946 6.0731 2.8109 7.0653 3.7610 8.2494 9.6425 47.2730 2.2984 3.7619 10.8086 0.5571 2.4063 1.2849 5.7739 5.2158 0.9701 0.3654 0.0857 2.6958 0.4638 0.2159 0.6013 0.4706 2.9967 3.2685 19.3538 9.9673 15.7987 3.0647 10.3598 7.0326 3.2842 12.4167 11.4794 7.6715 13.1557 15.4623 0.0503 21.7276 28.1295 72.5085 55.7232 7.4347 34.5471 33.9341 28.5817 13.1449 30.5867 6.9493 5.7644 49.0896 60.3376 57.6775 65.2010 86.3026 60.7603
temp: 298.150 k
press: 1.00000 atm
elementType: 6 6 6 6 6 6 6 6 6 1 1 1 1 1 1 1 1 1 1 1 1 1 1 1 1 1 1
symmnumber: 1
zpe: 644381.3 jmol-1
zpe.correction: 0.245432 hartree
zpe.thermalcorrener: 0.257649 hartree
zpe.thermalcorrenthalpy: 0.258594 hartree
zpe.thermalcorrgfe: 0.206178 hartree
zpe.sumelectzpe: -352.982747 hartree
zpe.sumelectthermal: -352.970530 hartree
zpe.sumelectthermalent: -352.969585 hartree
zpe.sumelectthermalfe: -353.022001 hartree
dipole: 0.0926 -0.0260 -0.0813
dipole: 0.1260
quadrupole: -58.4066 -60.2371 -58.0081
quadrupole: -1.6134 -0.2746 -0.3380
quadrupole: 0.4773 -1.3531 0.8758 -1.6134 -0.2746 -0.3380
hfenergy: -353.2281791 hartree
pointgroup: C01 [X(C9H18)]
dipole: -0.0357817 -0.0151623 0.0307463 debye
polarizability: 117.7392232|8.7667338|91.2496445|4.6675182|3.1193002|87.3682578 unknown
InChI: InChI=1S/C9H18/c1-4-5-6-7-8-9(2)3/h5-6,9H,4,7-8H2,1-3H3
charge 0 multiplicity 1
27 atoms
C  1.913858 -0.492876 0.094471
C  1.700497 1.018348 0.377353
C  0.383627 1.619231 -0.190116
C  2.042025 -0.787886 -1.419101
C  3.159136 -1.008681 0.854442
C  -0.864098 1.004191 0.4121
C  -1.885285 0.441297 -0.286128
C  -3.132551 -0.168458 0.322018
C  -3.299853 -1.666846 -0.042152
H  1.023443 -1.036011 0.474491
H  1.717293 1.179896 1.475811
H  2.5621 1.584167 -0.035689
H  0.357093 1.516983 -1.291954
H  0.389688 2.709684 0.021732
H  2.217797 -1.865517 -1.596308
H  1.129098 -0.503181 -1.972651
H  2.89444 -0.230239 -1.854687
H  3.309887 -2.092014 0.688755
H  3.06397 -0.840436 1.944032
H  4.072923 -0.48523 0.510548
H  -0.928399 1.030533 1.513223
H  -1.819106 0.405216 -1.386596
H  -4.027163 0.383858 -0.034482
H  -3.106197 -0.051198 1.422665
H  -4.234198 -2.078357 0.382661
H  -2.452227 -2.261049 0.344308
H  -3.336295 -1.805427 -1.139046
