program: Gaussian 09
title: 000009958
version: EM64L-G09RevD.01
frameworkgroup: C1[X(C7H8O2)]
method: RPBEPBE
basis: SDD
operation: Freq
keyword: #p
keyword: freq=noraman
keyword: PBEPBE/SDD
title: #p freq=noraman PBEPBE/SDD
converged: YES YES NO NO
title: Mulliken charges:
elementType: O O C C C C C C C H H H H H H H H
charge: -0.440973 -0.490505 0.498066 -0.463079 -0.435702 0.188851 0.138424 -0.324235 -0.806110 0.252986 0.230127 0.218105 0.229138 0.230623 0.221242 0.382333 0.370709
chargesum: 0.00000
title: Mulliken charges with hydrogens summed into heavy atoms:
elementType: O O C C C C C C C
charge: -0.058640 -0.119797 0.498066 -0.210092 -0.205575 0.188851 0.138424 -0.106131 -0.125106
polarizability: 1.12235471e+02 1.00426275e+00 9.04160350e+01 -6.41785933e-02 -3.19213452e-02 3.90286432e+01
1716.lowfreq: -11.5360 0.0005 0.0006 0.0011 6.9767 13.2908 48.5560 142.6492 212.7875
frequency: 48.4800 142.6488 212.7841 261.9110 275.3008 290.0761 343.9802 427.7997 434.0428 487.4265 491.2108 568.2668 586.6055 709.1722 709.6559 758.4779 782.5371 872.4266 908.7682 926.9979 997.7122 1046.6204 1075.9455 1142.8186 1151.9396 1180.8001 1243.0107 1273.5182 1313.1717 1392.8791 1402.3218 1462.4671 1469.8352 1480.6544 1505.3977 1611.7842 1634.2339 2975.7830 3053.4957 3083.3327 3116.8130 3146.3926 3152.5096 3525.7999 3625.2065
redmass: 1.0478 4.0449 4.2494 1.1076 4.2334 3.3346 5.0526 5.0384 2.8216 1.1119 4.6697 5.5234 3.6860 3.9894 5.4960 5.6388 1.3311 1.3659 1.3446 3.1890 1.5011 1.5231 2.1289 1.2638 1.7109 1.3978 1.9459 3.1119 1.5464 1.8603 2.1299 2.3301 1.0468 1.2879 3.2035 6.7524 6.6457 1.0371 1.0976 1.0987 1.0882 1.0948 1.0932 1.0648 1.0666
irintensity: 0.6143 1.8692 16.4941 167.1174 7.1667 4.1494 0.7323 1.4895 22.1723 131.1378 14.4808 4.0701 4.2079 0.5543 2.6956 33.2280 55.2673 12.8860 2.1010 20.9227 13.6856 13.1547 158.4773 4.0024 85.7563 71.3623 61.9200 152.3621 26.1580 4.5045 4.7455 8.7151 12.6124 10.5141 131.5651 33.6147 1.1164 40.6502 23.0744 21.5680 15.5032 20.2013 1.2017 74.8007 49.3934
temp: 298.150 k
press: 1.00000 atm
elementType: 8 8 6 6 6 6 6 6 6 1 1 1 1 1 1 1 1
symmnumber: 1
zpe: 348729.5 jmol-1
zpe.correction: 0.132824 hartree
zpe.thermalcorrener: 0.141573 hartree
zpe.thermalcorrenthalpy: 0.142518 hartree
zpe.thermalcorrgfe: 0.099316 hartree
zpe.sumelectzpe: -421.321206 hartree
zpe.sumelectthermal: -421.312457 hartree
zpe.sumelectthermalent: -421.311512 hartree
zpe.sumelectthermalfe: -421.354714 hartree
dipole: 0.2949 2.7418 -0.0054
dipole: 2.7576
quadrupole: -43.5674 -49.0957 -56.8034
quadrupole: 6.3476 -0.0764 -0.0280
quadrupole: 6.2548 0.7264 -6.9812 6.3476 -0.0764 -0.0280
hfenergy: -421.4540299 hartree
pointgroup: C01 [X(C7H8O2)]
dipole: -0.0961413 -1.0797356 -0.0443214 debye
dipolederiv: -0.8635601 0.6025107 0.0274836 0.6696078 -0.6951938 -0.01661 0.0304551 -0.0155822 -0.4206017 -1.3950123 -0.291945 -0.0040677 -0.2824376 -0.1928921 0.0155474 0.0000138 0.01624 -0.4370134 0.3073543 0.0077327 0.0005595 0.1993006 0.0829899 0.0036368 0.0209437 0.0085914 -0.0385147 -0.2335399 0.1691317 0.0071894 0.0018655 0.0355466 0.010656 -0.0016218 0.0084033 -0.200252 -0.1692205 0.0249385 0.0005978 -0.1746062 -0.0431571 0.0071158 -0.0079541 0.0056023 -0.2090366 0.6139696 -0.5412085 -0.0258692 -0.8570296 0.5853253 0.0267062 -0.0403464 0.0233972 0.081575 1.0768274 0.2620015 0.0005284 0.587912 -0.0765668 -0.0091481 0.012823 -0.0057764 -0.0093254 -0.0588347 -0.0830311 -0.0042948 0.0589785 0.050621 0.0086944 0.0008085 0.0092858 -0.1562168 -0.0688387 -0.0467228 -0.0024108 -0.1085528 0.0528478 0.0002487 -0.0206804 -0.0045241 0.0756949 0.0856723 -0.0486696 -0.0007847 -0.0436128 -0.0534344 -0.0083235 -0.0001968 -0.0075308 0.1649556 -0.0287731 0.1078452 0.0065572 0.0952285 -0.0123487 -0.0075256 0.0064431 -0.0084519 0.1642241 0.0317178 -0.0935258 -0.0024253 -0.0843127 -0.0929978 -0.0099767 -0.0017555 -0.0100722 0.1722397 0.0056273 -0.0312138 0.0182455 -0.0715407 0.003771 0.1210074 0.0863833 0.1172917 -0.0264919 -0.006477 -0.0357855 -0.0292619 -0.0610124 0.0477802 -0.1028997 -0.0987759 -0.1021326 -0.0659742 -0.0079326 0.0539335 0.0085402 0.164055 -0.0768196 -0.0211488 0.0179999 -0.0159676 0.1052952 0.3170395 -0.1419885 -0.0048838 -0.1264444 0.2903519 -0.0027563 -0.0045043 -0.0026889 0.3925296 0.3939805 0.0859969 0.0042966 0.0326014 0.0941766 -0.0152239 -0.0000355 -0.0160851 0.4069126 unknown
polarizability: 112.1874412|1.4254101|90.3775278|-0.4600829|2.0638417|39.1151798 unknown
InChI: InChI=1S/C7H8O2/c1-5-2-3-6(8)7(9)4-5/h2-4,8-9H,1H3
charge 0 multiplicity 1
17 atoms
O  -1.710296 1.797429 0.091324
O  -2.573427 -0.755832 0.000095
C  1.59472 0.063904 -0.005883
C  0.615295 1.091667 0.042806
C  1.16573 -1.285055 -0.056029
C  -0.754053 0.776562 0.043048
C  -1.166399 -0.582384 -0.00656
C  -0.213452 -1.61279 -0.056111
C  3.072796 0.417659 0.00179
H  0.905813 2.147045 0.080606
H  1.9083 -2.089415 -0.095624
H  -0.531821 -2.662539 -0.095433
H  3.329076 1.101195 -0.829153
H  3.35948 0.927097 0.941434
H  3.702688 -0.483264 -0.096135
H  -2.614388 1.385499 0.082825
H  -2.826461 -1.708278 -0.044198
