program: Gaussian 09
title: 000145078
version: EM64L-G09RevD.01
frameworkgroup: C1[X(C5H5N)]
method: RPBEPBE
basis: SDD
operation: Freq
keyword: #p
keyword: freq=noraman
keyword: PBEPBE/SDD
title: #p freq=noraman PBEPBE/SDD
converged: NO YES NO NO
title: Mulliken charges:
elementType: N C C C C C H H H H H
charge: -0.020544 0.182537 -0.256661 -0.256709 -0.701321 -0.187928 0.273476 0.273470 0.233871 0.233843 0.225965
chargesum: 0.00000
title: Mulliken charges with hydrogens summed into heavy atoms:
elementType: N C C C C C
charge: -0.020544 0.182537 0.016814 0.016761 -0.007641 -0.187928
polarizability: 6.50200622e+01 4.55584132e+00 4.71900460e+01 2.27934871e-02 -9.11472629e-03 4.58269972e+01
1716.lowfreq: -14.3276 -10.1108 -6.4147 0.0006 0.0006 0.0010 153.6882 172.3829 221.0567
frequency: 153.6529 172.3824 221.0562 344.3367 351.0675 548.8132 558.4179 628.8027 668.2138 750.9169 818.7429 907.8622 968.7787 985.6862 1067.2182 1160.0894 1212.4612 1389.7800 1466.6228 1471.4304 1646.0994 2174.3354 2987.2262 3081.3402 3100.0298 3232.5589 3286.2024
redmass: 1.0464 5.3216 3.9278 2.3537 2.7571 5.0530 4.0516 1.6894 2.9512 3.7535 1.4606 1.3558 1.4850 1.4606 1.5734 4.1131 5.4151 1.1995 1.0442 1.0511 5.1583 12.6311 1.0354 1.1000 1.1002 1.0862 1.1504
irintensity: 0.2549 2.0514 0.1416 1.7931 4.9244 2.0169 8.2549 80.1396 46.3216 0.0066 0.0884 6.4686 1.6395 25.7125 1.5364 23.6309 6.6085 12.5280 11.3564 13.5293 21.5073 14.7858 20.1922 19.4996 17.7538 3.4284 0.1645
temp: 298.150 k
press: 1.00000 atm
elementType: 7 6 6 6 6 6 1 1 1 1 1
symmnumber: 1
zpe: 211464.6 jmol-1
zpe.correction: 0.080543 hartree
zpe.thermalcorrener: 0.086905 hartree
zpe.thermalcorrenthalpy: 0.087849 hartree
zpe.thermalcorrgfe: 0.050996 hartree
zpe.sumelectzpe: -247.734106 hartree
zpe.sumelectthermal: -247.727743 hartree
zpe.sumelectthermalent: -247.726799 hartree
zpe.sumelectthermalfe: -247.763652 hartree
dipole: -4.3988 0.4724 0.0000
dipole: 4.4241
quadrupole: -44.1196 -33.5080 -31.7825
quadrupole: 3.1421 0.0011 -0.0014
quadrupole: -7.6496 2.9620 4.6875 3.1421 0.0011 -0.0014
hfenergy: -247.8146483 hartree
pointgroup: C01 [X(C5H5N1)]
dipole: 1.7274004 -0.2136035 -0.0010251 debye
dipolederiv: -0.405448 -0.0174828 -0.0010019 0.0439156 -0.204402 0.0002265 0.000086 0.000002 -0.2533296 0.0745752 -0.070554 -0.000035 -0.1391803 0.4418761 -0.0001048 -0.0003461 -0.0000348 0.005386 -0.0868859 0.1610978 0.07686 0.2493172 -0.1442319 0.077065 -0.2890782 -0.1916742 -0.0496251 -0.0870629 0.1608365 -0.0768711 0.2491028 -0.1441918 -0.0769358 0.2890054 0.1918432 -0.0497045 -0.0688737 0.015004 -0.0000146 -0.0252733 -0.0881259 0.0000668 -0.0002463 -0.0000027 0.1525228 0.2729105 -0.0118115 0.0009014 -0.0698117 -0.2155417 -0.0002196 0.00042 0.0000044 0.0125066 0.1320594 -0.1031928 -0.0527549 -0.1268271 0.1424836 -0.0654136 -0.0250963 -0.031749 0.0955324 0.1321938 -0.1032001 0.0528705 -0.1269254 0.142448 0.0653743 0.0252132 0.0316906 0.0955805 0.0827721 -0.0455112 0.082795 -0.034701 0.0035991 0.0392746 0.0697715 0.1045778 -0.05331 0.0830802 -0.0453127 -0.0825697 -0.0346603 0.0035703 -0.0392912 -0.0695336 -0.1046951 -0.0536712 -0.1293207 0.0601268 -0.0001798 0.0150434 0.0625161 -0.0000421 -0.0001955 0.0000377 0.0981122 unknown
polarizability: 65.161556|4.2675933|47.0485165|-0.0327691|0.0073095|45.827033 unknown
InChI: InChI=1S/C5H5N/c1-5(4-6)2-3-5/h2-3H,1H3
charge 0 multiplicity 1
11 atoms
N  -2.284558 0.340055 0.002084
C  0.3151 -0.223337 -0.000403
C  1.278449 0.799008 0.662637
C  1.278876 0.798953 -0.662886
C  0.615434 -1.727825 -0.00017
C  -1.115284 0.090952 -0.000723
H  1.63462 1.182946 1.613251
H  1.635654 1.18281 -1.613305
H  0.185719 -2.215463 0.893308
H  0.187427 -2.21535 -0.894508
H  1.705864 -1.89465 0.000814
