program: Gaussian 09
title: 000145073
version: EM64L-G09RevD.01
frameworkgroup: C1[X(C8H12O5)]
method: RPBEPBE
basis: SDD
operation: Freq
keyword: #pfreq=noraman
keyword: PBEPBE/SDD
title: #p freq=noraman PBEPBE/SDD
converged: YES YES NO NO
title: Mulliken charges:
elementType: O O O O O C C C C C C C C H H H H H H H H H H H H
charge: -0.238206 -0.273173 -0.272952 -0.240857 -0.240950 -0.111617 -0.110904 -0.303616 -0.304290 0.297478 0.297695 -0.755026 -0.755071 0.289967 0.289749 0.242574 0.220766 0.243143 0.220352 0.250334 0.253380 0.248760 0.250303 0.253451 0.248712
chargesum: 0.00000
title: Mulliken charges with hydrogens summed into heavy atoms:
elementType: O O O O O C C C C C C C C
charge: -0.238206 -0.273173 -0.272952 -0.240857 -0.240950 0.178350 0.178844 0.159724 0.159205 0.297478 0.297695 -0.002553 -0.002604
polarizability: 1.26909992e+02 1.68069664e-03 7.73190030e+01 -5.30599664e-01 8.41032779e-02 9.68537884e+01
1716.lowfreq: -9.5016 -4.5477 -0.9882 -0.0005 0.0004 0.0008 25.4599 32.9629 33.3623
frequency: 25.4320 32.9456 33.3324 45.7121 60.9250 68.3830 87.8533 129.6238 141.5571 195.7363 242.3946 250.3486 353.4244 357.2271 440.9364 489.1024 562.1888 563.5011 596.9675 627.8530 724.0866 752.1520 806.8267 818.8277 837.6333 874.5026 876.9413 939.8560 970.5826 994.5890 996.6627 1029.4082 1043.0044 1043.0495 1044.6205 1049.3807 1070.5069 1148.5744 1157.5957 1191.8273 1200.9808 1241.2906 1253.0039 1309.4863 1310.8719 1330.9575 1352.1929 1385.1592 1385.8648 1452.4430 1452.4518 1454.4672 1454.5916 1467.8343 1474.4930 1652.9676 1657.1595 2999.8056 3006.0980 3007.5429 3007.5554 3083.4348 3085.7449 3089.0024 3093.5405 3098.9016 3098.9437 3143.3650 3143.4034
redmass: 8.9649 1.1331 1.1509 5.2852 2.7813 4.1519 4.2488 2.9621 3.0260 6.8131 4.5508 4.7983 3.2566 3.3352 3.4071 3.2543 3.2229 3.2529 4.8775 4.1939 6.4366 5.5330 3.3117 5.2760 4.3896 5.0347 2.7603 3.4862 2.9483 1.8184 1.9269 2.3893 1.6995 1.6521 2.1575 3.8669 1.3727 1.1953 1.3487 2.8872 3.5591 1.9021 1.4156 1.4569 1.2103 1.3109 1.4624 1.2381 1.2512 1.0567 1.0567 1.0526 1.0526 1.0827 1.0872 9.8484 9.7136 1.0620 1.0652 1.0379 1.0379 1.0926 1.1008 1.0967 1.0898 1.0954 1.0954 1.1018 1.1018
irintensity: 1.1162 2.2968 1.6993 2.6888 4.3834 5.0588 5.7428 1.9971 2.4288 5.0751 1.4505 12.3249 9.4366 3.6057 19.3569 0.6537 2.8361 3.8490 0.8297 9.7029 16.8363 11.1712 5.5307 31.8706 11.5178 13.6943 26.4696 90.4264 0.4124 9.1122 144.2325 110.4584 18.8888 1.4932 0.2596 65.2355 4.7614 115.8584 0.0402 557.5331 54.3429 2.1333 30.6839 0.7856 10.8861 0.5529 4.8988 107.8605 0.0553 23.0848 25.4344 3.3511 39.0714 7.5069 7.8709 351.1842 11.8725 76.6990 0.7864 2.3390 0.7536 8.2627 1.1501 52.0249 5.9094 4.8798 9.2099 12.7440 3.9761
temp: 298.150 k
press: 1.00000 atm
elementType: 8 8 8 8 8 6 6 6 6 6 6 6 6 1 1 1 1 1 1 1 1 1 1 1 1
symmnumber: 1
zpe: 510623.8 jmol-1
zpe.correction: 0.194486 hartree
zpe.thermalcorrener: 0.209011 hartree
zpe.thermalcorrenthalpy: 0.209955 hartree
zpe.thermalcorrgfe: 0.149191 hartree
zpe.sumelectzpe: -687.145164 hartree
zpe.sumelectthermal: -687.130640 hartree
zpe.sumelectthermalent: -687.129695 hartree
zpe.sumelectthermalfe: -687.190460 hartree
dipole: -0.0117 -1.2271 -0.0013
dipole: 1.2272
quadrupole: -67.9854 -81.5244 -79.5111
quadrupole: 0.0333 16.0088 -0.0166
quadrupole: 8.3548 -5.1841 -3.1708 0.0333 16.0088 -0.0166
hfenergy: -687.3396502 hartree
pointgroup: C01 [X(C8H12O5)]
dipole: 0.005737 -0.4827633 0.0023917 debye
dipolederiv: -0.4158747 -0.001392 0.1499783 0.0007444 -0.4385999 -0.000484 0.1395217 0.0000485 -0.7199346 -1.5706413 0.3535025 0.3211292 0.3346937 -0.4135656 -0.0830978 0.3914897 -0.0850091 -0.6176773 -1.5688826 -0.3564448 0.3226039 -0.3370068 -0.4151457 0.0831 0.3927108 0.0854648 -0.6185097 -0.650145 0.0766061 -0.0872536 0.1324327 -0.3481161 -0.0792478 0.3106731 -0.1773548 -0.9380783 -0.649454 -0.0779222 -0.0872586 -0.1321486 -0.3476915 0.07653 0.3107075 0.1760474 -0.9393185 0.7799504 -0.1879269 -0.0553157 -0.0710072 0.2543379 -0.0764635 0.193513 -0.0764473 0.1269524 0.7805456 0.1896642 -0.0572493 0.0737726 0.255962 0.0762061 0.1927697 0.0760671 0.1263383 0.2389096 -0.0190563 -0.0249366 -0.0431624 0.1685495 0.2743918 -0.1444781 0.1226212 0.50796 0.2361289 0.0203458 -0.0207087 0.0425128 0.168089 -0.2735799 -0.1416957 -0.1214172 0.5103686 1.6924775 -0.3765352 -0.1198523 -0.4179274 0.3194347 0.2070932 -0.6059623 0.3202752 1.2924386 1.6898459 0.380845 -0.1208305 0.4202132 0.3200701 -0.203483 -0.6069238 -0.3186364 1.2949073 -0.348106 0.0434007 -0.1517415 -0.0182076 0.0250741 -0.0357627 -0.1936024 0.0092304 -0.1344675 -0.347751 -0.0453007 -0.1516352 0.0158433 0.0249699 0.0343804 -0.1940877 -0.0106696 -0.1347686 0.0101571 0.0472301 -0.0016338 -0.0016916 -0.0153061 -0.0542827 -0.0852977 -0.0676671 0.0449375 0.0103161 -0.0471214 -0.0015261 0.0015879 -0.0148911 0.0547388 -0.0857451 0.0677706 0.0443968 -0.0851707 -0.0561348 0.1092889 -0.05886 0.0650286 0.0024977 0.0697301 -0.0196995 0.0178894 -0.0332084 0.0221061 -0.1281178 0.0662014 0.0482341 -0.0749051 -0.0836025 -0.0221281 -0.0933241 -0.0830001 0.0563874 0.1090194 0.0587127 0.066201 -0.0025454 0.0698412 0.0193795 0.0174366 -0.0349838 -0.0227363 -0.1297149 -0.0673319 0.0475879 0.0744259 -0.0842454 0.0216256 -0.0928665 0.0908111 -0.0373496 0.0501303 0.0097494 0.0799436 0.0929352 0.0253911 0.0849394 -0.0080992 0.0883106 -0.0164149 -0.0284842 -0.0498189 -0.0462617 -0.0343127 -0.019619 -0.0270577 0.1189478 -0.0046373 0.0673901 0.0411864 0.0917305 0.0813117 -0.037606 0.0712986 -0.062139 0.041697 0.090647 0.0376932 0.0501445 -0.0095518 0.0789195 -0.0933474 0.0257047 -0.0854176 -0.0069672 0.0881558 0.0165425 -0.0286889 0.0499862 -0.0456373 0.035283 -0.0198532 0.0281062 0.1186326 -0.0044006 -0.0673787 0.0414668 -0.0914665 0.0815014 0.0375359 0.0717613 0.0620675 0.041109 unknown
polarizability: 125.4159671|0.0563065|77.3187633|-6.5538013|0.0261489|98.3480525 unknown
InChI: InChI=1S/C8H12O5/c1-5(9)12-7-3-11-4-8(7)13-6(2)10/h7-8H,3-4H2,1-2H3
charge 0 multiplicity 1
25 atoms
O  -0.009386 2.313066 -0.010313
O  1.825082 -0.211415 0.106305
O  -1.824622 -0.217788 -0.110377
O  2.774495 -0.693967 -1.96859
O  -2.771852 -0.695148 1.966729
C  0.516269 0.016702 -0.572504
C  -0.51653 0.017549 0.567059
C  0.41487 1.444808 -1.135692
C  -0.4188 1.448458 1.122965
C  2.900377 -0.558854 -0.732286
C  -2.898496 -0.565447 0.729913
C  4.167535 -0.714421 0.075512
C  -4.165273 -0.728766 -0.076922
H  0.34948 -0.764625 -1.330264
H  -0.347052 -0.75959 1.328547
H  1.374046 1.815712 -1.531803
H  -0.354829 1.477345 -1.930472
H  -1.376243 1.817067 1.525023
H  0.357311 1.48755 1.911406
H  3.970103 -1.261769 1.011252
H  4.555322 0.283416 0.350068
H  4.926458 -1.238689 -0.523097
H  -3.966528 -1.281431 -1.009271
H  -4.555225 0.266472 -0.357721
H  -4.923011 -1.251136 0.524833
