program: Gaussian 09
title: 000145063
version: EM64L-G09RevD.01
frameworkgroup: C1[X(C21H28N2O)]
method: RPBEPBE
basis: SDD
operation: Freq
keyword: #p
keyword: freq=noraman
keyword: PBEPBE/SDD
title: #p freq=noraman PBEPBE/SDD
converged: NO YES NO NO
title: Mulliken charges:
elementType: O N N C C C C C C C C C C C C C C C C C C C C C H H H H H H H H H H H H H H H H H H H H H H H H H H H H
charge: -0.288302 -0.255057 -0.015146 -0.123197 -0.456870 0.410061 -0.429258 -0.415277 -0.454378 -0.338505 -0.444193 -0.606128 0.187645 -0.493935 0.528768 -0.369306 -0.337140 -0.163337 -0.416747 -0.386828 -0.696494 -0.229473 -0.233437 -0.239443 0.207863 0.212507 0.203386 0.209368 0.213045 0.251311 0.222382 0.227049 0.219481 0.232178 0.241921 0.264109 0.207988 0.271730 0.227147 0.224653 0.227243 0.190940 0.175251 0.221682 0.218872 0.279704 0.214830 0.201910 0.221278 0.223226 0.226986 0.227938
chargesum: 0.00000
title: Mulliken charges with hydrogens summed into heavy atoms:
elementType: O N N C C C C C C C C C C C C C C C C C C C C C
charge: -0.288302 -0.255057 -0.015146 0.084666 -0.040978 0.410061 -0.006845 0.058416 -0.007848 -0.106327 0.061837 -0.126410 0.187645 -0.042135 0.528768 0.048876 0.059792 -0.163337 -0.197875 -0.107124 -0.058475 -0.006247 -0.006451 -0.011504
polarizability: 2.72281546e+02 1.14776311e+01 2.36697131e+02 -1.89559718e+01 -2.39640082e+00 1.87251370e+02
1716.lowfreq: -10.8201 -7.3394 0.0004 0.0004 0.0006 3.2150 8.3776 14.2522 17.1388
frequency: 5.0739 13.9054 16.6895 29.7911 32.0039 46.8801 54.6839 67.4386 74.0238 76.9737 86.7906 108.6752 120.5460 149.3692 179.9748 208.8256 223.8640 225.2842 236.7633 242.9516 277.5451 287.5023 308.0214 333.3880 357.6338 373.2292 404.4258 406.4807 426.8515 452.9974 466.5733 472.9200 503.2787 525.6739 538.1864 579.4881 606.6632 617.6562 648.8824 661.5472 706.7341 725.8388 746.8160 755.4592 769.8819 805.0844 816.3559 823.5325 828.1979 857.1033 860.0306 878.0781 892.7032 899.0385 926.2496 933.0975 934.4926 968.1240 977.3747 981.5908 983.7599 988.6504 989.9757 1001.3829 1025.9644 1030.2400 1031.9725 1061.3222 1068.5961 1082.0131 1083.3077 1088.5111 1096.7569 1114.1279 1115.4789 1131.2682 1171.4423 1175.7359 1180.7974 1188.0144 1194.3249 1212.2390 1218.2561 1232.3966 1236.1536 1244.7985 1257.3511 1279.4738 1286.8480 1296.0673 1300.6334 1303.1946 1312.4957 1326.4012 1332.2262 1335.1250 1342.8686 1348.6101 1353.4998 1356.2045 1359.4682 1371.7036 1387.8385 1388.4121 1442.3055 1444.7413 1449.2697 1453.0672 1455.3518 1458.6190 1467.1714 1468.1942 1471.2864 1475.6654 1478.0046 1482.5661 1484.2187 1571.4917 1593.7951 1612.8560 1670.1442 2198.8645 2911.2523 2953.1927 2960.9760 2967.3852 2972.4287 2978.1628 2982.3433 2984.5839 2991.2607 3001.3340 3012.4912 3015.8157 3017.6933 3030.9261 3039.3060 3044.1346 3048.1457 3058.9029 3070.0639 3071.3096 3075.1864 3077.1372 3108.4901 3116.9255 3124.3715 3136.2650 3147.4900 3162.1113
redmass: 4.4699 3.6573 5.5141 4.4803 4.2079 3.7689 4.3906 2.6219 2.5862 2.9990 2.9924 4.4322 2.9259 4.6610 3.6803 3.9657 3.0513 1.3000 2.7346 2.1407 3.0953 2.0735 3.1643 3.0164 4.1056 3.5406 2.7829 2.1118 3.0671 3.7834 3.9371 3.6558 4.1534 4.8257 3.8984 3.3156 4.1148 6.2132 3.0427 2.3272 1.7784 1.8533 1.4240 1.4942 2.0968 1.8898 2.8597 2.0418 1.7673 1.5955 1.3622 1.9410 1.7212 1.8266 1.9369 1.8515 1.8394 2.6285 1.7784 1.4165 2.3322 2.5938 5.0478 1.3373 2.2834 3.7800 2.6623 2.3357 1.9131 1.8715 1.9498 1.5474 1.7991 2.0149 1.7753 1.3306 1.1013 1.8067 1.3736 1.1355 1.6250 2.7828 1.4479 1.5126 1.3787 1.4848 1.2610 1.1762 1.1560 1.2970 1.2653 1.2664 1.4427 1.5690 1.3231 1.4348 1.5463 1.4622 1.5338 1.4636 1.4161 3.1722 4.1057 1.2365 2.0859 1.1166 1.0850 1.0906 1.0891 1.1446 1.0840 1.0831 1.0857 1.0795 1.0475 2.2134 1.0693 6.5855 6.0627 6.0420 7.7625 12.4334 1.0805 1.0663 1.0616 1.0617 1.0363 1.0627 1.0634 1.0599 1.0635 1.0607 1.0602 1.0944 1.0926 1.0983 1.0984 1.0998 1.1028 1.0986 1.1011 1.1022 1.0996 1.1022 1.0877 1.0914 1.0862 1.0916 1.0960 1.1015
irintensity: 0.1311 0.5176 1.0229 0.9176 2.0340 1.1541 1.4310 0.7358 3.3179 0.5422 0.6354 5.2325 0.1268 2.5387 0.5183 1.6944 0.3014 0.9056 0.9592 1.0958 2.1257 3.5617 7.1660 0.9166 1.7591 1.5124 0.0531 0.4017 11.7809 1.4141 4.3382 9.3321 2.8061 3.2232 2.4962 11.6475 22.5437 0.2760 17.1457 5.6292 57.4723 14.5722 3.5933 18.9391 11.0173 4.7892 10.6485 0.6555 6.6175 0.9304 0.3259 2.7493 5.0567 6.7493 4.9573 2.7910 17.1772 2.7216 4.7819 0.1796 17.4726 2.1311 0.7727 1.9020 6.5648 1.6667 3.3623 3.1942 1.8767 17.8445 16.0526 6.3003 3.2034 1.8880 0.5270 6.9790 2.9074 19.3181 12.8273 1.3376 51.6899 6.8190 8.5800 33.0894 21.0460 56.0538 3.7570 2.6984 4.4538 2.7989 0.2439 2.6513 11.6615 8.0285 10.9476 1.6326 0.7925 0.6485 6.6288 4.0805 8.6980 88.6695 21.1003 16.3592 6.7321 28.6575 2.9009 9.7287 7.5275 22.9183 7.9844 27.9401 7.7417 6.5455 10.9605 19.5611 11.4540 204.2583 0.1089 4.3590 3.0515 14.9709 24.0751 32.4892 45.2109 37.6336 36.2235 50.0945 26.3106 1.9749 30.5160 16.3580 34.4017 9.9052 33.4654 57.2695 9.8463 5.2622 52.4428 12.2256 29.6198 81.2667 48.0693 4.9796 14.3789 17.4350 1.1944 21.5461 20.3985 28.1839
temp: 298.150 k
press: 1.00000 atm
elementType: 8 7 7 6 6 6 6 6 6 6 6 6 6 6 6 6 6 6 6 6 6 6 6 6 1 1 1 1 1 1 1 1 1 1 1 1 1 1 1 1 1 1 1 1 1 1 1 1 1 1 1 1
symmnumber: 1
zpe: 1161325.4 jmol-1
zpe.correction: 0.442325 hartree
zpe.thermalcorrener: 0.467335 hartree
zpe.thermalcorrenthalpy: 0.468279 hartree
zpe.thermalcorrgfe: 0.381411 hartree
zpe.sumelectzpe: -999.944165 hartree
zpe.sumelectthermal: -999.919156 hartree
zpe.sumelectthermalent: -999.918212 hartree
zpe.sumelectthermalfe: -1000.005079 hartree
dipole: -3.5771 -4.6996 3.8970
dipole: 7.0759
quadrupole: -163.4164 -141.3647 -148.2033
quadrupole: 3.0879 12.6960 1.2483
quadrupole: -12.4216 9.6301 2.7915 3.0879 12.6960 1.2483
hfenergy: -1000.3864908 hartree
pointgroup: C01 [X(C21H28N2O1)]
dipole: 0.993619 1.9364527 1.7357623 debye
polarizability: 265.8116818|15.3060004|240.7208383|21.4372523|11.0517017|189.6975273 unknown
InChI: InChI=1S/C21H28N2O/c1-2-3-15-21(24)23(17-18-10-5-4-6-11-18)20-14-8-7-12-19(20)13-9-16-22/h4-6,10-11,14,19H,2-3,7-9,12-13,15,17H2,1H3
charge 0 multiplicity 1
52 atoms
O  0.467006 -2.730645 -0.499263
N  0.30356 -0.456965 -0.046285
N  -5.075786 0.879025 -2.529758
C  -0.984752 1.714776 0.254167
C  -1.444607 2.689139 1.374008
C  -0.011986 0.665148 0.815498
C  -0.27284 3.13882 2.272908
C  -2.190207 1.033904 -0.452415
C  0.356717 1.924357 2.990096
C  0.582818 0.771389 2.034911
C  -3.121946 2.061484 -1.153662
C  1.125611 -0.167131 -1.263995
C  0.013565 -1.798643 0.240026
C  -0.880203 -2.111184 1.447726
C  2.603552 0.029084 -0.949042
C  -1.80206 -3.323476 1.176363
C  -2.893685 -3.040767 0.119219
C  -4.202499 1.414301 -1.917314
C  3.175949 1.324355 -0.906357
C  3.427578 -1.096996 -0.68519
C  -3.81713 -4.254784 -0.115481
C  4.546598 1.49831 -0.604672
C  4.795901 -0.925132 -0.38246
C  5.35993 0.372726 -0.340904
H  -0.446029 2.314806 -0.515584
H  -1.932039 3.575345 0.924912
H  -2.208731 2.180868 1.998219
H  0.497775 3.636143 1.651037
H  -0.621233 3.883209 3.013161
H  -1.82523 0.311269 -1.204038
H  -2.775936 0.453335 0.28571
H  1.322052 2.206897 3.45343
H  -0.294782 1.595489 3.828135
H  1.282248 -0.017316 2.342793
H  -2.53166 2.692892 -1.847449
H  -3.583167 2.742251 -0.413948
H  0.711816 0.736239 -1.748294
H  0.987092 -1.03033 -1.937503
H  -0.21452 -2.342755 2.303766
H  -1.471442 -1.226283 1.743149
H  -1.178737 -4.171989 0.837399
H  -2.281512 -3.624526 2.129695
H  -3.503981 -2.169531 0.438002
H  -2.408492 -2.759749 -0.836064
H  2.549192 2.200694 -1.117164
H  2.983248 -2.098372 -0.722608
H  -3.236795 -5.126036 -0.47267
H  -4.329963 -4.55212 0.819211
H  -4.592395 -4.031241 -0.870812
H  4.979124 2.505104 -0.579764
H  5.424652 -1.80101 -0.185997
H  6.42326 0.504323 -0.110344
