program: Gaussian 09
title: 000145060
version: EM64L-G09RevD.01
frameworkgroup: C1[X(C21H28N2O)]
method: RPBEPBE
basis: SDD
operation: Freq
keyword: #p
keyword: freq=noraman
keyword: PBEPBE/SDD
title: #p freq=noraman PBEPBE/SDD
converged: YES YES NO NO
title: Mulliken charges:
elementType: O N N C C C C C C C C C C C C C C C C C C C C C H H H H H H H H H H H H H H H H H H H H H H H H H H H H
charge: -0.284414 -0.260262 -0.015378 -0.120203 -0.452935 0.373638 -0.431129 -0.416503 -0.450119 -0.317316 -0.447643 -0.596851 0.170938 -0.489178 -0.045019 0.530640 -0.706674 -0.711955 -0.163291 -0.381268 -0.427505 -0.233925 -0.227254 -0.240938 0.208400 0.203039 0.212411 0.212659 0.209524 0.230731 0.248498 0.219381 0.227552 0.234582 0.273615 0.207260 0.263984 0.242502 0.225025 0.227893 0.242046 0.214171 0.195843 0.232219 0.201069 0.218356 0.216138 0.276684 0.221599 0.227530 0.223768 0.228068
chargesum: 0.00000
title: Mulliken charges with hydrogens summed into heavy atoms:
elementType: O N N C C C C C C C C C C C C C C C C C C C C C
charge: -0.284414 -0.260262 -0.015378 0.088197 -0.037485 0.373638 -0.008946 0.062726 -0.003187 -0.082734 0.058842 -0.115977 0.170938 -0.036260 0.197027 0.530640 -0.064442 -0.076392 -0.163291 -0.104584 -0.205905 -0.006395 -0.003486 -0.012871
polarizability: 2.59785950e+02 -5.91707428e+00 2.34615335e+02 2.17601704e+01 -1.64433728e+01 1.98605079e+02
1716.lowfreq: -10.0486 -8.1070 -6.2548 -0.0007 0.0002 0.0006 11.0519 18.3239 30.3888
frequency: 9.7189 18.1499 30.1609 35.2077 38.5012 43.6394 55.9438 63.6363 73.7182 81.5137 92.1456 129.6501 144.0084 164.7807 188.4356 199.3615 220.6707 223.2259 236.9961 243.8441 289.8944 290.8680 323.5702 344.8372 367.9659 370.9454 386.2211 397.2059 404.4542 415.4391 441.4911 454.7661 471.1627 503.7346 528.7569 541.5751 561.9510 612.3034 617.3529 659.7720 696.0190 708.7627 737.7019 757.7819 779.1042 811.7681 818.3132 824.0973 830.3385 860.5773 875.8251 881.0157 883.7425 899.5596 919.3722 927.2923 934.0160 952.5959 960.2901 970.1481 977.3010 982.9194 987.2037 989.6403 1001.7988 1009.8493 1027.2006 1030.5070 1060.9747 1081.4027 1083.4786 1088.7741 1108.5826 1114.1269 1132.8737 1135.0325 1170.8685 1173.9805 1177.3117 1181.3871 1188.9184 1205.7407 1214.5023 1218.2032 1238.4350 1247.5258 1261.2684 1277.0468 1283.1746 1293.6917 1300.9330 1321.7422 1324.3455 1332.0989 1334.6849 1339.8626 1342.5028 1346.9653 1351.5433 1355.2042 1369.5656 1377.0345 1387.8687 1393.6047 1442.4702 1444.2341 1448.5626 1450.5181 1455.2172 1465.0471 1466.0889 1469.6587 1471.1901 1476.2398 1480.6877 1482.6344 1485.3266 1567.0964 1593.8810 1613.1190 1670.6715 2198.7564 2902.9445 2953.0365 2962.9998 2964.4564 2966.4949 2980.2932 2981.4333 2985.8908 3000.1647 3002.6858 3005.3816 3017.1844 3032.1143 3041.6625 3048.2880 3053.6539 3056.4602 3066.6207 3068.5067 3069.8986 3071.7573 3072.1861 3110.1719 3122.7723 3123.9897 3135.4082 3146.2229 3161.9023
redmass: 6.0916 4.4426 4.1086 3.7821 2.9675 3.7267 3.3353 5.9210 3.0154 5.2901 2.7424 3.6358 3.6085 3.9339 3.0653 1.1779 2.8028 3.3375 2.7973 1.2583 2.0931 3.8902 2.8077 3.1735 2.5036 2.9710 2.9818 2.0545 2.8127 2.3896 3.1863 3.5940 4.8359 4.2859 4.2675 3.9792 3.5556 3.9857 6.1150 3.1969 3.4648 1.8257 2.2524 1.5293 2.1295 2.2901 2.3859 2.6088 1.8172 1.2493 2.1424 1.6451 2.1784 1.7151 1.1854 1.8154 2.5255 1.6370 1.7064 2.4636 1.6863 1.3709 2.2688 5.3316 1.3451 2.9603 2.2111 3.8258 2.3423 2.1347 1.7152 1.5855 1.6864 1.6536 1.8501 1.6308 1.3182 1.5578 1.8591 1.2930 1.1370 1.8543 2.7270 1.4595 1.2734 1.4319 1.2499 1.1839 1.4307 1.2730 1.2004 1.5875 1.5644 1.4368 1.4551 1.5424 1.3822 1.4853 1.3736 1.4972 3.0154 1.2245 4.6001 1.2355 1.9960 1.1145 1.0959 1.1380 1.0891 1.0520 1.0845 1.0903 1.0539 1.0885 1.0572 2.2657 1.0459 7.2789 6.0735 6.0315 7.7847 12.4312 1.0810 1.0663 1.0360 1.0625 1.0371 1.0629 1.0632 1.0600 1.0602 1.0839 1.0599 1.0925 1.0980 1.0982 1.1026 1.0991 1.0977 1.0994 1.0978 1.1022 1.0992 1.1021 1.0876 1.0915 1.0863 1.0915 1.0962 1.1015
irintensity: 0.6167 1.0325 0.7371 1.7118 0.1812 0.5396 0.9392 0.8434 4.1835 3.6272 0.7099 2.4675 1.4214 0.7565 2.3962 0.2737 0.3211 2.0323 0.0233 1.2811 2.9384 6.3594 0.3065 2.3679 1.7778 0.5380 7.7123 0.7625 0.1872 0.1093 1.7473 1.2504 2.6529 16.7455 8.4105 3.1308 4.9397 22.3566 0.2405 17.1322 7.0802 56.5173 17.4698 24.1389 2.4404 0.1409 14.7789 1.7693 3.2277 0.4992 1.0900 8.6477 4.2313 7.8386 4.7745 8.1165 5.7906 3.3970 0.4846 1.9702 5.0501 0.2969 12.8344 1.3862 2.1806 8.1945 6.3658 1.6208 4.1133 6.1327 24.6737 4.5150 0.9692 0.1283 11.6789 0.4231 10.5806 14.2900 37.8715 4.8142 0.3038 68.5472 21.3584 3.6208 2.7775 28.6677 3.8176 3.9722 24.8768 4.6094 0.9718 12.3204 10.9211 1.7622 13.9099 0.4021 1.4312 0.0665 7.3619 15.6188 103.2888 17.0464 21.6140 9.7912 7.1126 6.9068 5.1699 28.1889 9.7605 2.9256 7.7081 12.8579 5.3396 10.3292 10.1406 16.7210 25.7942 224.3330 0.1254 4.1711 2.3575 15.9758 22.9912 29.2311 30.4808 40.4041 26.1511 17.2275 27.6491 2.6159 15.1234 1.0899 40.8045 31.9585 59.0802 9.5226 50.3303 13.0477 5.9739 21.8632 55.4430 9.0495 92.2012 36.4205 12.1616 14.4395 1.2367 16.8480 25.5523 27.3696
temp: 298.150 k
press: 1.00000 atm
elementType: 8 7 7 6 6 6 6 6 6 6 6 6 6 6 6 6 6 6 6 6 6 6 6 6 1 1 1 1 1 1 1 1 1 1 1 1 1 1 1 1 1 1 1 1 1 1 1 1 1 1 1 1
symmnumber: 1
zpe: 1159860.6 jmol-1
zpe.correction: 0.441768 hartree
zpe.thermalcorrener: 0.466792 hartree
zpe.thermalcorrenthalpy: 0.467736 hartree
zpe.thermalcorrgfe: 0.382759 hartree
zpe.sumelectzpe: -999.945478 hartree
zpe.sumelectthermal: -999.920454 hartree
zpe.sumelectthermalent: -999.919509 hartree
zpe.sumelectthermalfe: -1000.004487 hartree
dipole: 2.1663 -3.3870 5.9160
dipole: 7.1528
quadrupole: -166.1944 -136.3304 -155.6587
quadrupole: 1.4255 -13.4744 2.6025
quadrupole: -13.4665 16.3975 -2.9309 1.4255 -13.4744 2.6025
hfenergy: -1000.3872456 hartree
pointgroup: C01 [X(C21H28N2O1)]
dipole: -0.8667245 -1.8342566 -1.950308 debye
polarizability: 259.64956|10.4039028|239.682434|20.946852|5.7239341|193.6743694 unknown
InChI: InChI=1S/C21H28N2O/c1-17(2)15-21(24)23(16-18-9-4-3-5-10-18)20-13-7-6-11-19(20)12-8-14-22/h3-5,9-10,13,17,19H,6-8,11-12,15-16H2,1-2H3
charge 0 multiplicity 1
52 atoms
O  -0.409561 2.46403 1.39545
N  -0.075218 0.31854 0.562485
N  5.630637 -0.471813 2.557398
C  1.501384 -1.578894 -0.069956
C  2.011377 -2.351849 -1.317343
C  0.357111 -0.626943 -0.451436
C  0.85448 -2.858703 -2.205194
C  2.648663 -0.811084 0.645691
C  0.021684 -1.672827 -2.7404
C  -0.294442 -0.676882 -1.64487
C  3.763384 -1.764164 1.160216
C  -0.911068 -0.232695 1.675293
C  0.133027 1.704318 0.528412
C  1.074219 2.28364 -0.530384
C  0.493178 3.558459 -1.202671
C  -2.347895 -0.515463 1.254536
C  -0.743545 3.225623 -2.069932
C  1.583832 4.266569 -2.037117
C  4.797561 -1.057259 1.934919
C  -3.235965 0.563028 0.999204
C  -2.820024 -1.842645 1.108794
C  -4.568199 0.31346 0.604759
C  -4.155312 -2.095018 0.716224
C  -5.03266 -1.016574 0.46186
H  1.103739 -2.325837 0.656429
H  2.659477 -1.676983 -1.914775
H  2.640068 -3.205099 -0.99946
H  1.251596 -3.458987 -3.045097
H  0.199507 -3.526363 -1.610874
H  3.0914 -0.071054 -0.048032
H  2.239331 -0.244594 1.501269
H  0.56603 -1.163737 -3.564639
H  -0.925399 -2.035069 -3.185565
H  -1.110544 0.036224 -1.820086
H  -0.88786 0.528508 2.474805
H  -0.429788 -1.157086 2.044846
H  4.257342 -2.279977 0.315723
H  3.318593 -2.550667 1.802054
H  2.00584 2.563217 0.003171
H  1.340822 1.535978 -1.29691
H  0.171524 4.232129 -0.38471
H  -1.162938 4.143461 -2.521549
H  -0.474712 2.536229 -2.894593
H  -1.541817 2.75323 -1.467696
H  1.946633 3.614051 -2.855566
H  1.189502 5.191637 -2.496939
H  2.45373 4.543318 -1.412231
H  -2.872267 1.589737 1.123909
H  -2.143369 -2.6834 1.309366
H  -5.247436 1.152807 0.416951
H  -4.510123 -3.126804 0.611996
H  -6.068529 -1.20922 0.160266
