program: Gaussian 09
title: 000145037
version: EM64L-G09RevD.01
frameworkgroup: C1[X(C6H4S2)]
method: RPBEPBE
basis: SDD
operation: Freq
keyword: #p
keyword: freq=noraman
keyword: PBEPBE/SDD
title: #p freq=noraman PBEPBE/SDD
converged: YES YES YES YES
title: Mulliken charges:
elementType: S S C C C C C C H H H H
charge: 0.107547 0.107547 -0.346119 -0.346118 -0.152426 -0.152428 -0.152429 -0.152426 0.271712 0.271713 0.271714 0.271712
chargesum: 0.00000
title: Mulliken charges with hydrogens summed into heavy atoms:
elementType: S S C C C C C C
charge: 0.107547 0.107547 -0.346119 -0.346118 0.119286 0.119285 0.119285 0.119287
polarizability: 2.39759484e+02 -1.24745029e-05 7.41955945e+01 4.70391438e-03 3.12875039e-04 3.54114041e+01
1716.lowfreq: -6.5742 -1.2255 -0.0033 0.0012 0.0014 21.0683 70.4639 215.7022 229.9441
frequency: 70.4639 215.7019 229.9441 335.4522 346.2374 355.3144 484.1027 584.4932 597.8689 723.8985 740.1388 808.1458 847.9298 973.2067 991.7177 993.1847 1067.6224 1085.0682 1114.7934 1198.4945 1257.8801 1310.7239 1407.2109 1411.6430 1514.2669 1584.4825 3148.7246 3150.5079 3169.2043 3174.2174
redmass: 11.1859 5.7713 12.4869 22.7488 4.8866 3.0217 2.7038 8.0561 7.3232 5.0657 7.1131 1.2404 1.5499 2.9595 1.3429 1.2912 5.0061 1.5582 4.0636 1.2325 1.5221 2.4031 3.6104 1.8087 7.6136 6.2139 1.0874 1.0881 1.0981 1.0999
irintensity: 2.8813 0.0000 3.7272 0.0000 0.0000 0.0000 31.8253 12.8919 0.0000 0.0000 0.0000 0.0000 54.2424 1.4868 0.0000 0.0000 0.0000 14.2022 34.1336 0.0000 0.0000 0.3658 0.0000 49.0814 28.2512 0.0000 0.0000 0.1801 8.4326 0.0000
temp: 298.150 k
press: 1.00000 atm
elementType: 16 16 6 6 6 6 6 6 1 1 1 1
symmnumber: 1
zpe: 208704.3 jmol-1
zpe.correction: 0.079491 hartree
zpe.thermalcorrener: 0.086434 hartree
zpe.thermalcorrenthalpy: 0.087378 hartree
zpe.thermalcorrgfe: 0.047089 hartree
zpe.sumelectzpe: -1026.572383 hartree
zpe.sumelectthermal: -1026.565440 hartree
zpe.sumelectthermalent: -1026.564496 hartree
zpe.sumelectthermalfe: -1026.604786 hartree
dipole: 0.0000 0.0000 0.0010
dipole: 0.0010
quadrupole: -73.5321 -54.2348 -61.8518
quadrupole: 0.0000 -0.0004 0.0001
quadrupole: -10.3258 8.9714 1.3544 0.0000 -0.0004 0.0001
hfenergy: -1026.6518743 hartree
pointgroup: C01 [X(C6H4S2)]
dipole: 0.0000013 -0.0000004 0.0003773 debye
dipolederiv: -0.5523135 -0.0000009 -0.0000016 -0.0000009 -0.1860471 0.0000005 0.0000271 0.0000004 -0.1226185 -0.5523123 -0.0000009 0.0000179 -0.000001 -0.1860475 0.0000005 -0.0000096 0.0000004 -0.1226188 0.6080158 -0.0000001 -0.0000473 -0.0000008 0.2652567 -0.0000026 -0.0000776 -0.0000025 -0.0764857 0.6080138 -0.0000005 0.0000333 0.0000025 0.2652581 -0.0000021 0.0000369 -0.0000024 -0.0764853 -0.076207 0.2558168 0.0000405 0.1556085 -0.0370708 0.000016 -0.0000548 -0.0000169 -0.049773 -0.0762029 -0.2558147 0.0000447 -0.1556068 -0.0370718 -0.0000165 -0.0000507 0.0000159 -0.049773 -0.076203 -0.255814 -0.0000458 -0.1556069 -0.0370736 0.0000321 0.0000619 -0.0000053 -0.0497734 -0.0762062 0.2558167 -0.0000505 0.155607 -0.037071 -0.0000334 0.0000587 0.0000036 -0.0497733 0.0483536 -0.0713523 0.0000045 -0.0088457 -0.0025345 -0.0000217 0.0000016 -0.000019 0.1493249 0.0483539 0.0713513 0.0000033 0.0088453 -0.0025324 0.0000244 0.0000009 0.0000222 0.1493255 0.0483542 0.0713508 -0.0000002 0.0088448 -0.0025316 -0.0000239 0.0000028 -0.0000227 0.1493257 0.0483537 -0.071352 0.0000014 -0.0088459 -0.0025345 0.0000268 0.0000028 0.0000261 0.149325 unknown
polarizability: 239.7594843|0.0003695|74.1955945|-0.0047039|-0.0003129|35.4114041 unknown
InChI: InChI=1S/C6H4S2/c7-5-1-2-6(8)4-3-5/h1-4H
charge 0 multiplicity 1
12 atoms
S  3.167835 0.000001 -0.000938
S  -3.167869 -0.000015 -0.000783
C  1.44683 -0.000005 -0.000924
C  -1.446863 -0.000012 -0.000806
C  0.691335 1.248447 -0.000605
C  0.691342 -1.248464 -0.000587
C  -0.691377 1.248447 -0.000572
C  -0.691368 -1.248464 -0.000551
H  1.257395 2.185576 -0.000478
H  1.257406 -2.185589 -0.000443
H  -1.25744 2.185572 -0.000427
H  -1.257427 -2.185593 -0.000386
