program: Gaussian 09
title: 000145028
version: EM64L-G09RevD.01
frameworkgroup: C1[X(C13H18N2)]
method: RPBEPBE
basis: SDD
operation: Freq
keyword: #pfreq=noraman
keyword: PBEPBE/SDD
title: #p freq=noraman PBEPBE/SDD
converged: NO NO NO YES
title: Mulliken charges:
elementType: N N C C C C C C C C C C C C C H H H H H H H H H H H H H H H H H H
charge: -0.349901 -0.035978 0.338198 -0.106333 -0.092104 -0.092109 -0.542805 -0.538212 -0.538211 -0.451929 -0.451923 -0.451405 0.320825 -0.369301 -0.484392 0.196480 0.196502 0.196502 0.203229 0.203238 0.198124 0.214806 0.214807 0.198116 0.195205 0.194822 0.194823 0.195203 0.197433 0.189238 0.267702 0.263952 0.325399
chargesum: 0.00000
title: Mulliken charges with hydrogens summed into heavy atoms:
elementType: N N C C C C C C C C C C C C C
charge: -0.024502 -0.035978 0.338198 0.090147 0.104398 0.104393 -0.136338 -0.125282 -0.125288 -0.061902 -0.061898 -0.064734 0.320825 -0.101598 -0.220440
polarizability: 1.64765824e+02 5.88784109e-01 1.34024427e+02 3.88922489e-04 4.28342542e-05 1.10464829e+02
1716.lowfreq: -25.7377 -0.0008 -0.0004 0.0005 4.1062 15.3783 20.1031 100.2941 127.3601
frequency: 13.5156 100.2905 127.3340 276.1445 276.3306 279.5250 296.4210 376.8586 377.5088 401.7267 405.2307 433.3707 437.2041 448.3633 585.0200 635.4898 635.5929 658.5484 667.8416 679.5143 757.9073 785.5236 805.1779 812.6905 829.9571 843.0071 869.0787 869.9685 872.6556 915.3008 937.7050 940.3152 954.7370 969.1596 969.7475 981.5941 1009.5744 1045.2292 1045.9328 1047.9942 1063.8558 1101.8152 1102.0763 1103.5957 1103.9090 1110.8352 1131.3077 1177.8188 1181.6706 1210.1897 1246.2373 1252.9765 1279.7334 1284.7589 1286.5662 1289.9805 1303.4573 1310.4504 1312.3854 1322.8917 1323.0745 1338.7626 1341.2528 1353.7547 1358.0843 1358.8313 1370.0177 1431.9818 1449.0653 1449.8967 1459.6736 1460.3949 1464.8440 1481.1440 1546.0093 2955.3509 2957.1524 2957.3627 2959.5955 2960.2314 2963.2557 2988.8266 2989.5539 3002.0892 3012.8953 3013.0723 3014.9585 3024.0741 3024.0879 3025.8985 3221.9810 3228.2679 3618.1212
redmass: 3.8598 4.2026 3.7785 2.5014 2.4483 5.4714 1.9561 3.2153 3.3359 3.7224 2.4238 1.9298 2.4825 1.6527 2.5342 3.4570 3.8603 1.5699 4.1239 2.5582 4.3790 1.6700 2.7391 2.3624 3.7363 1.3737 1.5721 1.5821 1.5833 5.7784 2.0810 2.0832 3.8747 2.2086 2.1877 2.3760 2.3084 1.8406 1.8566 1.7229 4.3566 1.2507 1.3429 1.5972 1.0706 1.0128 1.8778 1.2204 1.2041 1.5812 1.5735 1.5533 2.4799 1.8081 1.9542 1.8891 2.4243 1.5631 1.8672 2.8697 1.3129 1.4811 1.4709 1.5889 1.5803 1.6222 3.8403 1.8908 1.0818 1.0841 1.0933 1.0912 1.0934 1.0916 4.3945 1.0601 1.0632 1.0612 1.0622 1.0603 1.0611 1.0831 1.0835 1.0830 1.1031 1.1031 1.1033 1.1020 1.1023 1.1020 1.0978 1.0984 1.0825
irintensity: 3.2272 0.3507 0.8972 0.4753 0.4722 0.0205 0.0190 0.0358 0.1017 0.4131 0.1101 0.0193 0.0996 0.0574 48.4197 0.0982 0.0395 23.2614 3.0363 54.8071 1.4978 23.2174 2.0650 0.7795 1.5277 27.8057 0.0018 0.1611 0.0690 16.4275 0.4782 0.0062 8.5580 3.7230 4.1122 24.0756 17.8356 0.1685 0.0110 0.0310 7.9995 3.4004 4.1447 2.8731 0.5848 0.0482 15.0657 0.8208 0.6657 0.8833 0.1376 0.0067 6.0185 0.0185 1.4740 0.0025 7.7454 0.8686 2.7485 0.1735 0.0001 3.6607 2.1952 1.7783 0.1930 0.7494 4.0750 10.8812 0.0677 0.5103 17.0131 16.8355 15.4066 0.3052 2.1063 22.4825 19.0683 15.3497 14.5878 16.4126 94.5519 156.9220 158.0659 42.6730 1.2447 3.0102 0.0452 78.0700 101.3048 67.2770 1.3542 1.1199 70.8537
temp: 298.150 k
press: 1.00000 atm
elementType: 7 7 6 6 6 6 6 6 6 6 6 6 6 6 6 1 1 1 1 1 1 1 1 1 1 1 1 1 1 1 1 1 1
symmnumber: 1
zpe: 757566.1 jmol-1
zpe.correction: 0.288542 hartree
zpe.thermalcorrener: 0.299937 hartree
zpe.thermalcorrenthalpy: 0.300881 hartree
zpe.thermalcorrgfe: 0.250482 hartree
zpe.sumelectzpe: -614.554152 hartree
zpe.sumelectthermal: -614.542757 hartree
zpe.sumelectthermalent: -614.541812 hartree
zpe.sumelectthermalfe: -614.592212 hartree
dipole: 1.2443 -2.2853 0.0000
dipole: 2.6021
quadrupole: -93.0370 -85.7533 -92.2059
quadrupole: 12.0202 -0.0002 0.0001
quadrupole: -2.7049 4.5788 -1.8738 12.0202 -0.0002 0.0001
hfenergy: -614.8426938 hartree
pointgroup: C01 [X(C13H18N2)]
dipole: 0.5013895 -0.8925793 0.0000188 debye
polarizability: 164.7449106|0.994556|134.0453401|0.0003883|0.000048|110.4648289 unknown
InChI: InChI=1S/C13H18N2/c1-9-2-11-3-10(1)5-13(4-9,6-11)12-7-14-15-8-12/h7-11,14H,1-6H2
charge 0 multiplicity 1
33 atoms
N  -3.803854 -0.682103 -0.000005
N  -3.888349 0.700397 -0.000037
C  -0.144875 0.004629 -0.000018
C  1.951472 1.472857 -0.00016
C  1.961854 -0.722169 1.268282
C  1.961913 -0.722513 -1.268018
C  0.400129 1.465509 -0.00019
C  0.410148 -0.726017 1.268101
C  0.410202 -0.726353 -1.267905
C  2.473859 0.744152 1.267714
C  2.473915 0.743802 -1.267817
C  2.481239 -1.452859 0.000243
C  -1.663946 -0.012953 -0.000033
C  -2.499433 -1.147663 -0.00002
C  -2.576523 1.095506 -0.000014
H  2.308288 2.522127 -0.000302
H  2.327279 -1.244001 2.175345
H  2.327374 -1.244594 -2.174923
H  0.021375 2.003963 0.892537
H  0.021407 2.003739 -0.893066
H  0.034329 -1.769153 1.289991
H  0.023138 -0.222975 2.176782
H  0.023245 -0.223562 -2.176746
H  0.034391 -1.769499 -1.28954
H  3.582366 0.760755 1.285617
H  2.12281 1.268611 2.179646
H  2.122912 1.268026 -2.179901
H  3.582425 0.760407 -1.28567
H  3.589867 -1.474271 0.00027
H  2.13387 -2.50648 0.000376
H  -2.269805 -2.211286 -0.000012
H  -2.350144 2.159933 -0.000019
H  -4.664378 -1.224763 -0.000005
