program: Gaussian 09
title: 000145021
version: EM64L-G09RevD.01
frameworkgroup: C1[X(C18H16)]
method: RPBEPBE
basis: SDD
operation: Freq
keyword: #p
keyword: freq=noraman
keyword: PBEPBE/SDD
title: #p freq=noraman PBEPBE/SDD
converged: NO YES NO NO
title: Mulliken charges:
elementType: C C C C C C C C C C C C C C C C C C H H H H H H H H H H H H H H H H
charge: -0.280563 -0.281550 -0.316195 -0.320167 -0.526764 -0.558707 0.451738 0.447172 0.498099 0.506510 -0.419727 -0.419084 -0.459551 -0.426230 -0.404548 -0.404685 -0.411799 -0.438096 0.225272 0.224220 0.256162 0.253465 0.248346 0.247800 0.238775 0.231952 0.228834 0.228531 0.238604 0.230042 0.226988 0.226347 0.227903 0.230909
chargesum: 0.00000
title: Mulliken charges with hydrogens summed into heavy atoms:
elementType: C C C C C C C C C C C C C C C C C C
charge: -0.055290 -0.057330 -0.060034 -0.066702 -0.030618 -0.087980 0.451738 0.447172 0.498099 0.506510 -0.190892 -0.190553 -0.220947 -0.196188 -0.177560 -0.178338 -0.183897 -0.207188
polarizability: 2.38285012e+02 -2.99872030e-01 1.36569475e+02 1.12453788e+00 1.34054201e+01 1.57058380e+02
1716.lowfreq: -12.0391 -0.0006 -0.0005 -0.0004 2.5756 14.0829 82.1118 154.3188 160.7078
frequency: 82.0508 154.2879 160.7073 164.2504 203.6644 209.9620 236.6722 308.4166 334.6818 361.9059 385.8967 390.5151 401.3692 424.8349 456.4380 479.3255 526.9577 543.7920 559.4410 571.2040 620.2739 625.4142 651.1404 665.1328 712.1716 719.7876 744.5116 761.4526 766.2745 784.4125 794.2766 797.4358 815.0534 826.5770 857.6941 904.5390 927.1836 935.2499 937.8807 945.2067 947.5481 955.6237 997.3974 1001.4930 1015.3654 1029.6563 1047.6592 1058.9591 1075.9012 1086.9711 1090.1109 1095.8554 1112.9924 1120.2067 1146.8472 1147.9350 1182.8033 1190.2658 1198.4934 1201.6146 1227.5283 1281.5098 1291.2867 1299.3946 1329.1487 1335.0484 1356.3087 1361.6524 1384.9477 1389.4373 1433.3833 1439.8868 1457.2926 1459.2089 1485.1344 1487.9728 1550.2612 1554.3540 1593.6283 1598.3670 3066.0954 3076.3249 3077.2156 3096.1224 3099.8137 3105.2621 3107.9008 3108.8766 3111.8986 3112.9207 3130.5996 3133.3837 3141.2094 3143.2478 3183.4402 3197.2134
redmass: 3.4824 4.0278 5.8710 5.8123 3.0659 3.8778 3.0474 3.9091 5.7561 3.5952 4.1095 3.1511 3.2367 3.2502 3.2196 3.2557 2.7872 3.1987 3.2292 4.0127 6.3301 6.1254 2.9528 2.2053 4.9239 3.9578 4.7206 2.9418 4.4955 1.3571 3.2636 1.3847 1.4345 1.7272 1.4621 2.3581 3.6855 1.3436 1.5652 1.3904 1.7919 1.4429 3.1916 2.7097 1.4129 1.6687 1.5949 1.2732 1.2839 1.7642 1.6372 1.3806 1.4814 1.3499 1.2674 2.1801 1.3121 1.1245 1.6408 2.8498 1.4317 1.8134 1.3442 1.8426 2.4257 2.6595 2.9646 2.4727 3.0414 2.8046 1.3536 1.2388 1.2061 1.2649 2.5471 2.4769 5.6004 5.3596 6.1660 6.1460 1.0836 1.0597 1.0831 1.0870 1.0612 1.0858 1.0855 1.0870 1.0883 1.0863 1.0960 1.0956 1.0958 1.0957 1.1161 1.1137
irintensity: 1.1218 0.0277 0.0703 0.0595 1.0675 0.0627 0.2501 3.6976 0.6075 1.5040 0.3817 1.5618 0.2379 0.5081 3.0093 0.0294 2.1210 22.1328 1.8196 0.1683 0.9310 1.9561 0.9799 27.9105 12.2054 2.2595 107.9430 1.2261 1.7950 1.9822 1.7290 10.6878 3.7792 114.5975 1.5518 6.5363 2.3668 13.7611 8.1196 0.2156 4.4434 2.4618 0.1702 1.2624 0.4001 2.0959 2.1000 11.0359 18.8171 1.3975 4.0739 3.3959 19.7260 12.1431 17.3997 0.3311 3.6898 0.3187 4.4476 26.8645 0.5034 0.6392 0.1206 1.5728 5.5193 1.7477 0.6998 4.0151 1.4170 0.8502 4.0440 0.6662 19.7415 0.4619 14.9609 14.1794 0.3012 1.3278 38.7845 0.6060 0.1357 40.6984 10.9651 4.9736 15.9613 1.3735 1.2305 5.5805 35.8322 36.5347 10.4869 45.3415 2.2651 10.1504 14.3344 18.3446
temp: 298.150 k
press: 1.00000 atm
elementType: 6 6 6 6 6 6 6 6 6 6 6 6 6 6 6 6 6 6 1 1 1 1 1 1 1 1 1 1 1 1 1 1 1 1
symmnumber: 1
zpe: 733663.8 jmol-1
zpe.correction: 0.279438 hartree
zpe.thermalcorrener: 0.292596 hartree
zpe.thermalcorrenthalpy: 0.293540 hartree
zpe.thermalcorrgfe: 0.241476 hartree
zpe.sumelectzpe: -694.108941 hartree
zpe.sumelectthermal: -694.095782 hartree
zpe.sumelectthermalent: -694.094838 hartree
zpe.sumelectthermalfe: -694.146903 hartree
dipole: 0.1952 0.0292 0.2359
dipole: 0.3076
quadrupole: -95.2488 -120.2858 -94.8706
quadrupole: 0.2971 0.9017 5.4700
quadrupole: 8.2196 -16.8174 8.5978 0.2971 0.9017 5.4700
hfenergy: -694.3883786 hartree
pointgroup: C01 [X(C18H16)]
dipole: 0.0772718 0.0082066 0.0927716 debye
polarizability: 238.2944744|0.328633|135.5234717|0.5984822|12.5422967|158.0949201 unknown
InChI: InChI=1S/C18H16/c1-2-12-4-3-11(1)15-9-17(15)13-5-7-14(8-6-13)18-10-16(12)18/h1-8,15-18H,9-10H2
charge 0 multiplicity 1
34 atoms
C  -2.535712 -0.734846 -0.473802
C  -2.600382 0.640142 0.254264
C  2.766894 -0.711457 0.415528
C  2.75633 0.863133 0.135213
C  -3.908076 -0.073727 -0.183063
C  3.410427 -0.115151 -0.84343
C  -1.400291 -1.6176 0.014014
C  -1.452902 1.568524 -0.107163
C  1.43802 -1.425484 0.359838
C  1.412831 1.505682 -0.094207
C  -0.504144 -2.021426 -1.018497
C  -0.710423 2.033548 1.021395
C  0.894769 -1.920699 -0.851307
C  0.698082 1.998393 1.030997
C  -0.837937 -1.505143 1.319915
C  -0.72656 1.460789 -1.327141
C  0.560942 -1.394267 1.481804
C  0.68825 1.414627 -1.312441
H  -2.36715 -0.578402 -1.548514
H  -2.547193 0.493749 1.342454
H  3.451948 -1.007392 1.219917
H  3.440779 1.421491 0.786215
H  -4.463638 0.220284 -1.080473
H  -4.545274 -0.388476 0.651065
H  4.502485 -0.113842 -0.910756
H  2.913422 -0.290924 -1.801852
H  -0.902294 -2.21951 -2.021853
H  -1.239718 2.231972 1.962104
H  1.547991 -2.090967 -1.714418
H  1.230541 2.196264 1.969698
H  -1.482303 -1.304031 2.184586
H  -1.246017 1.216179 -2.261701
H  0.957354 -1.127004 2.469372
H  1.215651 1.16607 -2.240657
