program: Gaussian 09
title: 000145012
version: EM64L-G09RevD.01
frameworkgroup: C1[X(C6F10)]
method: RPBEPBE
basis: SDD
operation: Freq
keyword: #p
keyword: freq=noraman
keyword: PBEPBE/SDD
title: #p freq=noraman PBEPBE/SDD
converged: NO NO NO NO
title: Mulliken charges:
elementType: F F F F F F F F F F C C C C C C
charge: -0.134918 -0.134917 -0.118093 -0.118095 -0.128111 -0.139868 -0.140981 -0.128109 -0.140998 -0.139853 0.217884 0.217880 0.118726 0.118727 0.325364 0.325363
chargesum: 0.00000
title: Mulliken charges with hydrogens summed into heavy atoms:
polarizability: 1.27978252e+02 -1.66725263e+01 7.30612917e+01 -3.17815555e-03 3.13652092e-03 4.42321472e+01
1716.lowfreq: -14.6930 -7.7647 -0.0006 0.0007 0.0011 3.7317 6.3450 35.6769 37.7529
frequency: -14.6927 35.6764 36.9439 44.1336 78.4369 103.3694 140.8144 204.5250 215.2090 224.4219 231.6654 282.0769 295.9496 301.8575 344.2043 344.7790 399.5601 402.7345 443.1369 453.4261 499.7603 542.2204 542.6105 578.1365 610.4442 615.9544 652.7004 697.6191 711.3594 908.2208 1008.3343 1010.2110 1019.3986 1041.5535 1070.8237 1109.4507 1134.1677 1229.9812 1239.3976 1352.2822 1637.5120 1670.6901
redmass: 18.6870 18.9195 18.8688 17.3208 17.5159 17.7938 17.6717 17.6761 18.0948 17.7566 17.8537 18.4621 18.5142 18.8612 13.9017 18.4590 17.7977 15.8014 16.3170 17.0052 17.6984 15.7108 14.7000 16.6344 17.2927 13.3445 17.9274 12.2720 16.4081 13.4538 13.0775 13.0772 13.2817 13.0813 12.9069 13.4292 13.8471 12.3800 12.5273 12.3324 12.0604 12.0430
irintensity: 0.0259 0.1664 0.0006 0.7358 1.2142 0.0000 0.0001 0.0000 1.0816 0.0015 3.7669 6.4699 0.0002 0.0000 3.4426 3.9878 0.0000 0.0021 3.1302 14.8333 0.0002 71.2118 5.4322 2.1396 0.0002 0.0003 0.0016 0.0067 7.4445 0.0467 9.0494 526.1411 261.5611 1.6830 325.4182 0.0127 311.0976 0.0043 669.3225 0.0013 12.2299 0.0001
temp: 298.150 k
press: 1.00000 atm
elementType: 9 9 9 9 9 9 9 9 9 9 6 6 6 6 6 6
symmnumber: 1
zpe: 152319.0 jmol-1
zpe.correction: 0.058015 hartree
zpe.thermalcorrener: 0.072635 hartree
zpe.thermalcorrenthalpy: 0.073579 hartree
zpe.thermalcorrgfe: 0.014337 hartree
zpe.sumelectzpe: -1225.767876 hartree
zpe.sumelectthermal: -1225.753256 hartree
zpe.sumelectthermalent: -1225.752312 hartree
zpe.sumelectthermalfe: -1225.811554 hartree
dipole: 0.0000 0.0000 -0.0233
dipole: 0.0233
quadrupole: -98.4777 -92.1595 -84.6468
quadrupole: -2.0451 -0.0008 -0.0007
quadrupole: -6.7163 -0.3982 7.1145 -2.0451 -0.0008 -0.0007
hfenergy: -1225.8258914 hartree
pointgroup: C01 [X(C6F10)]
dipole: 0.0000029 -0.0000125 -0.009163 debye
dipolederiv: -0.1998219 -0.0850894 -0.0000032 0.0075068 -0.6214014 0.0001511 0.0000875 -0.0004683 -0.1015474 -0.1998203 -0.0850906 0.0000167 0.0075074 -0.6214105 -0.0000647 -0.0000828 0.0005175 -0.1015462 -0.1823787 -0.041123 -0.0001257 0.5171651 -0.7634207 -0.0000147 -0.0008802 0.0006178 -0.0695541 -0.1823737 -0.0411289 0.0001241 0.517154 -0.7634161 0.0001544 0.0008031 -0.0005214 -0.0695556 -0.680993 0.3200261 0.0027236 0.20561 -0.5384939 -0.0027217 0.0012044 -0.0024982 -0.2717666 -0.5456164 -0.0438353 0.083745 -0.2723836 -0.3843328 0.2469417 0.1282994 0.1916155 -0.6189532 -0.5502397 -0.0419308 -0.0855993 -0.2722373 -0.3778541 -0.2437676 -0.1348254 -0.1877671 -0.6261695 -0.6809897 0.3200258 -0.0029577 0.2056116 -0.5384948 0.00293 -0.0013584 0.0027206 -0.27177 -0.5503835 -0.0418931 0.0856825 -0.2722437 -0.3776181 0.243631 0.1350451 0.1876262 -0.6264093 -0.5454852 -0.0438708 -0.0836672 -0.2723701 -0.3845704 -0.2470678 -0.1280854 -0.1917467 -0.6187078 0.2550514 0.0563537 -0.000535 0.0007592 0.627082 -0.0000159 -0.0006979 0.0004566 0.1509096 0.2550581 0.0563557 0.0005315 0.0007594 0.627096 -0.0000607 0.0006772 -0.0004779 0.1509113 -0.315871 0.1358953 0.0002908 -0.5962272 0.7925655 0.0000147 0.0043707 -0.0013135 -0.0926603 -0.3158876 0.1359053 -0.0003151 -0.5962112 0.7925569 -0.0001997 -0.0044338 0.0012 -0.0926625 2.2198683 -0.3002983 -0.0005762 0.4098054 1.2658546 -0.000512 0.0023391 -0.000672 1.6297414 2.2198829 -0.3003018 0.0006654 0.4097941 1.2658577 0.0006018 -0.0024627 0.0007109 1.62974 unknown
polarizability: 127.8770245|-16.8381108|73.1625188|0.0031687|-0.0031461|44.2321472 unknown
InChI: InChI=1S/C6F10/c7-1(3(9)5(11,12)13)2(8)4(10)6(14,15)16
charge 0 multiplicity 1
16 atoms
F  0.850773 1.617022 -0.001683
F  -0.850778 -1.617012 -0.001506
F  1.799652 -1.90151 -0.00129
F  -1.79963 1.901529 -0.001696
F  4.203347 -0.928332 -0.00801
F  3.452687 0.901056 -1.1263
F  3.455739 0.883142 1.141385
F  -4.203339 0.928365 -0.008929
F  -3.455973 -0.882452 1.141666
F  -3.452477 -0.901666 -1.126007
C  0.691251 0.231881 -0.002236
C  -0.69125 -0.231875 -0.002209
C  1.833117 -0.519234 -0.001781
C  -1.833115 0.519249 -0.001969
C  3.230495 0.080847 0.000364
C  -3.230498 -0.080812 0.000203
