program: Gaussian 09
title: 000144994
version: EM64L-G09RevD.01
frameworkgroup: C1[X(C12H21NO)]
method: RPBEPBE
basis: SDD
operation: Freq
keyword: #p
keyword: freq=noraman
keyword: PBEPBE/SDD
title: #p freq=noraman PBEPBE/SDD
converged: YES YES NO NO
title: Mulliken charges:
elementType: O N C C C C C C C C C C C C H H H H H H H H H H H H H H H H H H H H H
charge: -0.264413 -0.413332 0.312524 -0.579824 -0.527897 0.457356 -0.722723 -0.738328 0.135870 -0.538826 -0.325391 -0.121692 -0.679836 -0.691215 0.205071 0.241037 0.224150 0.236513 0.198671 0.216297 0.241169 0.209825 0.223035 0.209186 0.261843 0.293412 0.226799 0.215085 0.202722 0.220527 0.206212 0.216253 0.219123 0.211291 0.219507
chargesum: 0.00000
title: Mulliken charges with hydrogens summed into heavy atoms:
elementType: O N C C C C C C C C C C C C
charge: -0.264413 -0.119920 0.312524 -0.133716 -0.067234 0.457356 -0.066587 -0.096282 0.135870 -0.276983 0.116493 0.081030 -0.036844 -0.041294
polarizability: 1.80691147e+02 1.24802404e+01 1.43909896e+02 2.56113895e+00 6.13004578e+00 1.06552297e+02
1716.lowfreq: -7.5094 -0.0002 0.0005 0.0007 6.3201 11.6832 33.8586 35.7492 80.6224
frequency: 33.1810 35.0102 80.6197 87.4957 118.7672 181.5756 182.9021 200.3360 205.9501 213.4417 225.8706 232.2180 257.1335 281.0105 319.7435 349.2330 372.8343 401.4850 410.8703 420.0935 456.1935 466.3461 478.7284 543.3931 543.9477 588.3684 631.7916 792.9634 823.6751 837.5253 860.5406 889.3318 904.9534 911.8342 919.7350 924.1189 937.8973 952.9673 961.7685 968.4560 990.7658 1010.2702 1083.4153 1122.5336 1143.3773 1148.1711 1157.0088 1172.9769 1182.0395 1243.9323 1251.5168 1265.0360 1265.8124 1286.7774 1293.8815 1311.4991 1327.8544 1334.9107 1344.3103 1368.6082 1377.1477 1385.0964 1395.2156 1404.0970 1435.5344 1443.4413 1465.1973 1465.6739 1469.7846 1470.3239 1480.2835 1483.0204 1483.9662 1489.1457 1490.7873 1505.9574 1566.2177 1621.6341 2943.6434 2950.2141 2952.6573 2962.5968 2964.9173 2973.6735 2975.5777 2976.6853 2994.2795 3003.0907 3049.3753 3057.2013 3065.0727 3065.4138 3070.2095 3070.9143 3076.3377 3080.9104 3084.1942 3154.7750 3550.1325
redmass: 3.1610 2.6738 3.4638 3.1587 3.4870 1.3755 3.2235 1.1739 1.2929 2.7597 1.9422 1.2900 1.4833 2.2108 2.3694 2.5459 2.1857 2.3203 1.8119 1.4595 2.6979 3.3146 3.5176 3.2121 2.4992 3.3053 5.2329 3.1124 2.5546 1.5620 3.5641 1.8447 1.7936 1.3476 1.7330 1.4625 1.4236 1.4791 2.0418 1.7968 1.8532 1.3835 3.5040 1.5396 2.0097 1.5159 1.8842 1.9258 1.7307 1.2036 1.9258 2.2089 1.3204 1.5317 1.7610 1.6136 4.7451 1.4554 1.6364 1.7675 1.2091 1.2128 1.2134 1.2175 1.0864 1.0834 1.0483 1.0487 1.0614 1.0533 1.0603 1.0497 1.1013 1.0601 1.0800 1.7987 9.0024 5.7736 1.0594 1.0592 1.0810 1.0537 1.0453 1.0358 1.0376 1.0364 1.1035 1.1006 1.0953 1.0991 1.0992 1.0997 1.0984 1.0991 1.0998 1.0993 1.0988 1.0905 1.0770
irintensity: 0.3077 1.4776 1.8389 1.9189 0.3570 0.7558 1.6954 0.0099 0.2932 0.5924 1.8634 1.0068 0.0929 1.5215 0.2783 1.9959 1.6887 0.5323 22.7607 44.5533 8.5576 2.4302 4.6852 12.4991 4.1026 4.0643 3.6043 0.2994 3.1770 20.9934 8.3830 5.5367 1.7356 4.0272 10.1754 1.9317 1.5576 4.0494 2.3892 5.0274 5.3424 0.1260 9.8005 6.3159 7.1217 2.5123 17.0023 9.3761 16.6207 10.3577 45.0670 72.5121 7.0194 17.7702 2.3264 10.3767 40.9417 6.4231 4.2688 13.8294 19.2162 18.1241 18.6044 17.7946 12.3841 3.2657 1.6604 5.0528 10.9594 4.3520 5.3767 17.4621 13.5541 1.1228 103.5895 232.2988 179.9221 445.8858 21.8645 24.5716 29.2599 18.3498 49.7398 34.7905 27.6301 19.7119 37.9361 23.7966 10.3275 34.5784 16.9747 31.9340 53.6038 43.1907 39.3447 69.8315 30.3595 13.8875 40.9378
temp: 298.150 k
press: 1.00000 atm
elementType: 8 7 6 6 6 6 6 6 6 6 6 6 6 6 1 1 1 1 1 1 1 1 1 1 1 1 1 1 1 1 1 1 1 1 1
symmnumber: 1
zpe: 806064.1 jmol-1
zpe.correction: 0.307014 hartree
zpe.thermalcorrener: 0.323205 hartree
zpe.thermalcorrenthalpy: 0.324149 hartree
zpe.thermalcorrgfe: 0.263648 hartree
zpe.sumelectzpe: -598.742254 hartree
zpe.sumelectthermal: -598.726063 hartree
zpe.sumelectthermalent: -598.725119 hartree
zpe.sumelectthermalfe: -598.785620 hartree
dipole: -4.3262 -5.6814 -1.4869
dipole: 7.2942
quadrupole: -81.8450 -100.8138 -87.5008
quadrupole: -11.1079 -1.6487 -1.1081
quadrupole: 8.2082 -10.7606 2.5524 -11.1079 -1.6487 -1.1081
hfenergy: -599.0492681 hartree
pointgroup: C01 [X(C12H21N1O1)]
dipole: 1.7215715 2.2269244 -0.5589985 debye
polarizability: 180.8884591|12.3191269|143.8044413|-1.8118453|-5.8422077|106.4604394 unknown
InChI: InChI=1S/C12H21NO/c1-9(2)8-13-10-5-11(14)7-12(3,4)6-10/h5,9,13H,6-8H2,1-4H3
charge 0 multiplicity 1
35 atoms
O  -2.189081 -2.815888 0.395111
N  1.2883 0.44291 -0.389666
C  -2.438111 0.891567 -0.017308
C  -1.054202 1.113406 -0.694568
C  -2.878051 -0.573784 -0.293589
C  -0.030736 0.045415 -0.332275
C  -2.339185 1.145961 1.510151
C  -3.466907 1.872736 -0.631731
C  -1.824937 -1.635107 0.071348
C  -0.42349 -1.244749 0.003019
C  2.432718 -0.448301 -0.150403
C  3.775547 0.31871 -0.20174
C  3.899407 1.341185 0.954047
C  4.950137 -0.685998 -0.175108
H  -0.665929 2.117238 -0.423184
H  -1.192099 1.111179 -1.796275
H  -3.105135 -0.692147 -1.374631
H  -3.807393 -0.818169 0.253134
H  -2.025828 2.187556 1.715876
H  -3.32159 0.986465 1.991557
H  -1.613776 0.465326 1.989345
H  -3.566394 1.720192 -1.723468
H  -4.464414 1.725386 -0.177914
H  -3.170108 2.925237 -0.457779
H  0.306149 -2.024197 0.244106
H  1.48884 1.411582 -0.642011
H  2.434449 -1.261497 -0.9068
H  2.323231 -0.932127 0.843179
H  3.815668 0.868116 -1.167771
H  4.839799 1.915449 0.869859
H  3.063012 2.064393 0.969689
H  3.905686 0.82013 1.930152
H  4.906734 -1.384155 -1.031271
H  4.931831 -1.285723 0.755025
H  5.919658 -0.157697 -0.214606
