program: Gaussian 09
title: 000144971
version: EM64L-G09RevD.01
frameworkgroup: C1[X(C9H14)]
method: RPBEPBE
basis: SDD
operation: Freq
keyword: #p
keyword: freq=noraman
keyword: PBEPBE/SDD
title: #p freq=noraman PBEPBE/SDD
converged: NO YES NO NO
title: Mulliken charges:
elementType: C C C C C C C C C H H H H H H H H H H H H H H
charge: -0.184773 -0.184769 -0.144353 -0.144353 -0.566983 -0.566983 -0.411288 -0.411286 -0.400732 0.231816 0.231814 0.238357 0.238355 0.235661 0.213923 0.235658 0.213926 0.194802 0.196488 0.194803 0.196488 0.196714 0.196714
chargesum: 0.00000
title: Mulliken charges with hydrogens summed into heavy atoms:
elementType: C C C C C C C C C
charge: 0.047043 0.047045 0.094003 0.094003 -0.117398 -0.117399 -0.019997 -0.019995 -0.007304
polarizability: 9.58460535e+01 3.10561419e-05 9.32406597e+01 1.65037710e+00 3.81097879e-05 7.45112710e+01
1716.lowfreq: -0.0004 -0.0002 0.0003 29.2829 32.6523 34.6215 181.6785 202.9863 261.7206
frequency: 181.6656 202.9538 261.6937 281.7046 306.1090 370.4397 398.5710 430.4143 566.4908 606.6070 727.2297 742.7219 766.9740 799.9549 829.3279 831.4720 887.0383 898.2217 908.7687 925.5879 958.8588 984.4242 1037.5121 1040.4928 1043.6537 1058.7371 1068.1188 1086.8334 1100.4656 1101.3977 1146.9658 1157.8435 1191.4478 1210.6485 1213.0025 1240.8736 1268.3243 1293.9611 1307.0698 1323.4027 1343.4976 1368.9788 1380.7548 1402.3809 1456.5302 1456.6654 1466.4904 1475.8167 1477.6620 2962.3375 2976.1870 2984.2146 3009.0661 3029.4032 3039.0614 3079.6063 3079.6884 3086.3620 3086.9789 3101.8725 3102.8764 3183.6220 3183.9272
redmass: 2.4209 2.0462 2.0755 2.9231 2.6410 3.9759 2.6901 2.5533 2.2418 2.1369 1.9347 1.7868 3.2197 1.8086 1.4617 1.7754 2.0607 1.7064 1.7942 1.4839 2.3648 2.1872 1.6041 1.4314 1.2636 1.4237 1.3900 2.1310 1.2207 1.2366 1.8377 1.8201 1.4211 1.2994 1.7123 1.3122 1.2183 1.2947 1.4090 1.3181 1.3704 1.6889 1.8824 2.4430 1.3030 1.2414 1.0847 1.0824 1.1028 1.0593 1.0609 1.0622 1.1004 1.1002 1.1010 1.0562 1.0565 1.0880 1.0875 1.0941 1.0925 1.1148 1.1142
irintensity: 0.0238 0.0165 0.6123 0.0066 0.2291 0.0066 1.0359 2.5653 3.5733 6.7295 1.8270 0.4240 5.6933 13.8764 8.4515 23.8443 0.9259 1.7612 1.1038 1.4310 0.5899 1.6353 13.3512 13.9454 11.1426 2.7315 0.0029 1.9689 0.1809 0.0830 0.4563 1.0695 0.7913 0.9936 1.0402 0.9652 0.5620 2.6963 0.1215 0.3215 0.1503 2.8181 0.8682 0.1089 3.0948 6.2459 3.4214 26.8130 3.3232 25.7048 68.4174 47.0504 20.8879 39.8701 56.4021 37.5553 13.8928 20.7159 10.2710 1.5827 64.4511 6.6651 48.5134
temp: 298.150 k
press: 1.00000 atm
elementType: 6 6 6 6 6 6 6 6 6 1 1 1 1 1 1 1 1 1 1 1 1 1 1
symmnumber: 1
zpe: 541262.1 jmol-1
zpe.correction: 0.206156 hartree
zpe.thermalcorrener: 0.213967 hartree
zpe.thermalcorrenthalpy: 0.214911 hartree
zpe.thermalcorrgfe: 0.174529 hartree
zpe.sumelectzpe: -350.581276 hartree
zpe.sumelectthermal: -350.573465 hartree
zpe.sumelectthermalent: -350.572521 hartree
zpe.sumelectthermalfe: -350.612904 hartree
dipole: 0.0000 0.2414 0.0000
dipole: 0.2414
quadrupole: -56.9225 -56.8298 -53.3302
quadrupole: 0.0000 -1.2996 0.0000
quadrupole: -1.2284 -1.1356 2.3640 0.0000 -1.2996 0.0000
hfenergy: -350.7874322 hartree
pointgroup: C01 [X(C9H14)]
dipole: -0.0000092 -0.0949649 0.0000001 debye
dipolederiv: -0.039602 -0.0967689 0.0279556 -0.1067643 0.0563608 -0.0126173 0.109624 -0.000261 0.0911364 -0.0395507 0.0967897 0.0279528 0.1067849 0.0563259 0.0126184 0.1096154 0.0002438 0.0911344 0.1068086 -0.0157716 0.0054696 -0.0287493 -0.1135048 -0.0184401 -0.0185012 -0.0261258 0.1011338 0.106815 0.0157267 0.0054717 0.0287075 -0.1135151 0.018438 -0.0184998 0.0261329 0.1011342 -0.1381188 0.0787443 0.0824266 0.1185098 -0.0667717 -0.0578242 0.0850905 -0.0685616 0.0661825 -0.1381591 -0.0787301 0.0824303 -0.1184976 -0.0667289 0.0578121 0.0851036 0.0685483 0.0661836 0.1002177 0.0313946 0.0291568 0.0302388 0.1149557 0.0124308 -0.0076947 -0.0458446 0.068356 0.1002056 -0.0313931 0.0291538 -0.0302399 0.1149681 -0.0124362 -0.0076861 0.0458452 0.0683537 0.0400153 0.0000017 0.0299354 0.000002 0.0700767 0.0000004 0.0349988 0.0000026 0.1531567 -0.0234208 -0.0395122 0.0217372 -0.0311903 0.0293063 0.0832743 -0.0276979 0.1106578 -0.0888354 -0.0234064 0.0395256 0.0217211 0.0312019 0.0292847 -0.0832832 -0.0277206 -0.1106554 -0.0888297 0.0432816 -0.021258 -0.0717834 -0.0425228 -0.0144157 -0.0410532 -0.0994598 -0.0330591 -0.1033403 0.0432991 0.0212445 -0.0717688 0.0425107 -0.0144294 0.0410723 -0.0994477 0.0330808 -0.1033437 -0.0576563 0.1205599 -0.0381136 0.1243796 0.0073793 0.0327877 -0.0717845 0.0581816 0.0285958 0.0679101 0.0243246 -0.0160638 0.0307463 0.0874411 0.0096214 0.0506178 -0.0393723 -0.1230072 -0.0577061 -0.1205478 -0.0381201 -0.1243673 0.0074252 -0.0327861 -0.0717974 -0.0581725 0.0285924 0.0678944 -0.0243224 -0.0160529 -0.0307393 0.0874544 -0.0096221 0.0506355 0.0393565 -0.1230049 -0.1426954 -0.1248907 0.054549 -0.1216539 -0.0700889 0.0424576 0.0345741 0.0423556 0.0715414 0.0559463 0.0266726 -0.0658149 0.0288753 0.0039999 -0.1051743 -0.0391873 -0.0587811 -0.1137391 -0.1426464 0.1249043 0.0545408 0.1216672 -0.0701379 -0.0424681 0.0345669 -0.0423644 0.0715408 0.0559356 -0.0266816 -0.0657947 -0.0288846 0.0040119 0.1051868 -0.0391766 0.0587898 -0.1137396 0.0073295 0.0927807 -0.0444861 0.041252 -0.0697068 0.105288 -0.0330714 0.1651214 -0.0746042 0.0073033 -0.092793 -0.0445026 -0.0412668 -0.0696908 -0.105283 -0.0331017 -0.1651186 -0.0745977 unknown
polarizability: 95.8379354|-0.0003162|93.2406597|-1.7020213|0.0001068|74.5193891 unknown
InChI: InChI=1S/C9H14/c1-2-6-4-8(6)9-5-7(9)3-1/h6-9H,1-5H2
charge 0 multiplicity 1
23 atoms
C  -0.610745 1.139288 -0.447905
C  0.610984 1.139177 0.447919
C  -1.544392 -0.096495 -0.446353
C  1.544382 -0.096795 0.446416
C  -2.025146 1.233337 0.153328
C  2.025418 1.232924 -0.153284
C  -1.202242 -1.259153 0.486197
C  1.202014 -1.259394 -0.486136
C  -0.000195 -2.115588 0.000037
H  -0.482255 1.642606 -1.414609
H  0.482588 1.64255 1.414607
H  -1.973523 -0.385862 -1.414726
H  1.973427 -0.386253 1.414801
H  -2.776706 1.818718 -0.385731
H  -2.111356 1.289212 1.245066
H  2.777082 1.818162 0.385788
H  2.111692 1.288765 -1.245016
H  -2.091716 -1.907392 0.619357
H  -0.964493 -0.850373 1.487551
H  2.091359 -1.907806 -0.619303
H  0.964334 -0.850567 -1.487489
H  0.31672 -2.780349 0.82929
H  -0.317229 -2.780313 -0.829204
