program: Gaussian 09
title: 000144967
version: EM64L-G09RevD.01
frameworkgroup: C1[X(C10H12O)]
method: RPBEPBE
basis: SDD
operation: Freq
keyword: #pfreq=noraman
keyword: PBEPBE/SDD
title: #p freq=noraman PBEPBE/SDD
converged: YES YES NO NO
title: Mulliken charges:
elementType: O C C C C C C C C C C H H H H H H H H H H H H
charge: -0.192354 -0.314306 -0.452998 -0.457512 -0.453678 -0.542185 0.471353 0.471447 0.151508 -0.772676 -0.761170 0.227991 0.263891 0.233301 0.223458 0.235183 0.244980 0.246558 0.266228 0.232949 0.220141 0.237539 0.220350
chargesum: 0.00000
title: Mulliken charges with hydrogens summed into heavy atoms:
elementType: O C C C C C C C C C C
charge: -0.192354 -0.086314 -0.189107 -0.000752 0.026485 -0.029398 0.471353 0.471447 0.151508 -0.319587 -0.303281
polarizability: 1.18435078e+02 -2.35263301e-01 1.11882677e+02 -5.14633263e+00 6.49990231e+00 8.24033365e+01
1716.lowfreq: -12.3684 -0.0004 -0.0002 0.0003 5.1260 18.2551 50.4814 88.9651 171.1253
frequency: 50.2132 88.9547 171.1064 190.2332 303.5176 330.3511 359.6674 416.4909 444.5329 465.3665 483.2435 554.5538 579.9393 656.0869 707.5944 719.9651 735.5828 753.7272 810.5458 835.2985 850.4856 884.1688 921.6779 935.8995 942.7045 945.1632 966.7042 1013.4591 1054.8663 1063.8342 1096.4837 1138.2821 1172.1618 1186.1789 1220.5107 1229.6749 1248.5364 1266.2091 1276.8858 1293.7590 1315.0444 1321.6592 1338.1942 1420.5711 1424.1306 1448.6542 1467.9093 1484.8602 1634.8390 1645.0914 1658.6961 2992.6205 2992.8819 3009.8613 3041.3166 3049.6183 3051.3809 3073.2977 3075.0650 3093.4109 3097.2642 3193.4021 3199.3014
redmass: 3.4311 5.2894 2.3633 2.1801 2.2405 2.5203 3.2808 5.3018 4.2302 2.9372 3.2775 4.2316 2.6854 1.5072 1.4009 3.9830 2.0538 2.3384 1.7530 1.8737 2.4083 2.5236 1.9941 1.5239 1.4887 2.3202 1.6489 2.0941 1.6915 2.5451 1.6101 1.1925 1.5861 2.0341 1.3819 1.9372 1.4409 1.5029 1.5049 2.0657 1.4008 1.4817 1.6183 1.1274 1.1591 1.2204 1.0760 1.0885 5.4758 8.2097 6.1588 1.0607 1.0602 1.0620 1.0882 1.1012 1.1014 1.0881 1.1040 1.0624 1.0611 1.1140 1.1140
irintensity: 1.0125 3.3485 1.5999 1.9664 1.7631 0.6608 2.1603 3.7911 3.0580 12.2512 2.5881 3.1261 0.4869 0.1898 3.7020 2.0626 1.0865 0.3652 8.4084 6.0784 3.3865 3.7050 7.1028 0.2990 111.2208 30.9791 2.1908 5.4374 0.6179 1.6430 52.4780 9.8511 5.5983 8.0804 5.2873 17.5684 0.7286 3.0241 2.3425 4.5783 0.4151 4.6274 5.0570 8.6722 24.3600 14.7900 7.4707 7.8250 63.4868 114.8100 53.6142 15.1368 22.4845 52.5748 37.7714 12.2863 3.6439 16.6816 40.0238 4.1994 9.0532 13.6472 9.4163
temp: 298.150 k
press: 1.00000 atm
elementType: 8 6 6 6 6 6 6 6 6 6 6 1 1 1 1 1 1 1 1 1 1 1 1
symmnumber: 1
zpe: 504786.3 jmol-1
zpe.correction: 0.192263 hartree
zpe.thermalcorrener: 0.201789 hartree
zpe.thermalcorrenthalpy: 0.202733 hartree
zpe.thermalcorrgfe: 0.157488 hartree
zpe.sumelectzpe: -462.634410 hartree
zpe.sumelectthermal: -462.624884 hartree
zpe.sumelectthermalent: -462.623940 hartree
zpe.sumelectthermalfe: -462.669184 hartree
dipole: 2.3536 -1.9669 1.3279
dipole: 3.3423
quadrupole: -72.8150 -62.4937 -66.2291
quadrupole: 5.3269 -5.3874 3.3590
quadrupole: -5.6357 4.6856 0.9501 5.3269 -5.3874 3.3590
hfenergy: -462.8266729 hartree
pointgroup: C01 [X(C10H12O1)]
dipole: 0.9690311 0.7684205 -0.4468526 debye
dipolederiv: -0.9335872 -0.2340398 0.2046184 -0.2972114 -0.4910011 -0.005349 0.2488655 -0.0448562 -0.4491335 0.0221139 0.0461625 -0.0186792 0.0327619 0.0973322 0.0023295 -0.0192231 0.0414638 0.0836289 -0.2904816 0.0847755 0.1791001 0.1201332 -0.063306 -0.0026525 0.1868416 0.0171025 -0.160526 0.0714717 -0.0190527 -0.0413379 0.0167249 0.0984718 0.011767 -0.0005395 -0.0425161 0.0224619 0.0905395 0.0174169 0.0179148 0.0170848 0.0902917 -0.0797697 0.0145991 0.0154742 0.1137332 0.0093721 -0.1163003 -0.0290317 -0.0920672 -0.2027823 -0.161808 -0.0822501 -0.2326589 -0.0912754 0.1253276 -0.0839162 0.0409167 -0.1209895 0.2264195 0.052125 0.0340581 0.076187 -0.0655356 0.3704262 -0.036644 0.0907603 0.0177281 0.0854725 0.029921 0.2473989 -0.0115308 -0.0562412 0.9964419 0.3571425 -0.3473824 0.295927 0.6178982 0.3057251 -0.5075492 0.3084864 0.6204841 -0.232985 -0.1018066 0.0088042 -0.0683571 -0.0636138 0.1007051 0.0298239 0.0824792 -0.3511104 -0.1252112 0.0633284 0.1568581 0.0285343 -0.2332608 0.0376279 0.1107416 0.0514513 -0.3053189 -0.0017603 -0.1088247 -0.0553401 -0.0545625 -0.0904386 -0.0683127 -0.0413402 -0.0889748 0.0009493 0.0238175 -0.0285662 -0.0208505 -0.0632617 -0.091026 -0.0727657 -0.0228864 -0.0388062 0.0253139 -0.0491022 -0.1170333 0.0976022 -0.0601204 0.0143555 0.0341357 0.0807509 0.043092 -0.0131318 -0.0621405 0.1551838 -0.0307099 0.1031745 -0.0893956 0.0047014 -0.0353324 -0.0193247 0.0498614 -0.1180939 0.0240404 -0.1273927 0.0424331 0.0197767 0.021382 -0.0801308 0.02407 0.0301959 0.0274022 0.0148411 0.1229944 -0.0124027 0.0271785 -0.035735 0.0729365 -0.0351337 -0.0866552 -0.0730495 0.0790569 0.0185102 0.060772 -0.0181865 -0.029224 0.0036566 0.0268524 0.1192042 0.0862479 -0.0397181 -0.0417611 -0.0147762 0.0604256 0.074607 -0.0056935 0.0465187 -0.0604307 0.0766164 -0.0100187 -0.0306698 -0.0618224 -0.0489973 -0.0945266 -0.0488718 -0.0834436 0.1281629 0.0067803 0.0834417 -0.029371 0.1325795 -0.0268306 -0.0340547 -0.0143696 -0.04739 0.1728435 0.049441 -0.0790499 -0.0715789 -0.0395413 -0.0036288 -0.0624929 -0.0510228 -0.0852153 0.1218123 -0.0695868 0.0495808 -0.0939742 0.0172589 0.0848454 -0.028336 -0.1204636 -0.0033274 0.1507072 unknown
polarizability: 118.0451569|-0.5797106|111.0513704|6.5355787|7.94529|83.6245646 unknown
InChI: InChI=1S/C10H12O/c1-6-7(2)9-4-3-8(6)5-10(9)11/h8-9H,1-5H2
charge 0 multiplicity 1
23 atoms
O  -2.620446 -0.85541 0.783609
C  0.310745 1.403134 0.402993
C  -0.679347 -0.745543 -0.737895
C  -0.111365 1.739129 -1.061342
C  -0.665182 0.448329 -1.755311
C  -0.951698 0.918293 1.170359
C  1.333814 0.265525 0.363611
C  0.746469 -0.975933 -0.22947
C  -1.543651 -0.300632 0.451112
C  2.612967 0.412479 0.805091
C  1.351646 -2.192651 -0.315687
H  0.741614 2.293379 0.894521
H  -1.108351 -1.653775 -1.191645
H  0.756609 2.138044 -1.615149
H  -0.880997 2.533657 -1.041555
H  -1.686976 0.611938 -2.142719
H  -0.031712 0.15877 -2.612566
H  -1.724344 1.709019 1.226983
H  -0.709168 0.631798 2.211829
H  2.95983 1.36037 1.23119
H  3.348735 -0.398248 0.755493
H  0.83752 -3.052802 -0.757347
H  2.368889 -2.36647 0.053095
