program: Gaussian 09
title: 000009947
version: EM64L-G09RevD.01
frameworkgroup: C1[X(C8H7FO)]
method: RPBEPBE
basis: SDD
operation: Freq
keyword: #pfreq=noraman
keyword: PBEPBE/SDD
title: #p freq=noraman PBEPBE/SDD
converged: YES YES NO YES
title: Mulliken charges:
elementType: F O C C C C C C C C H H H H H H H
charge: -0.210542 -0.189731 0.282692 -0.354728 -0.335707 0.091972 -0.228274 -0.220245 -0.220476 -0.288331 0.232151 0.279550 0.234348 0.238036 0.237335 0.225990 0.225959
chargesum: 0.00000
title: Mulliken charges with hydrogens summed into heavy atoms:
elementType: F O C C C C C C C C
charge: -0.210542 -0.189731 0.282692 -0.122577 -0.056157 0.091972 0.006074 0.017792 0.016859 0.163618
polarizability: 1.22331830e+02 -4.84338360e+00 9.40285986e+01 1.37972051e-02 7.92830784e-03 3.92824588e+01
1716.lowfreq: -6.8722 -6.6955 -0.0010 -0.0007 0.0004 9.8318 49.7178 93.5657 156.1200
frequency: 49.7103 93.5559 156.1198 157.4218 281.3993 325.0177 397.0533 411.7958 452.1590 570.7674 612.1159 648.6079 693.7447 766.6360 778.0295 856.9202 934.8814 944.4440 989.2153 990.4272 997.9612 1014.5904 1024.5608 1043.5581 1089.0697 1175.3440 1191.9498 1196.7644 1227.1362 1318.4291 1349.4036 1388.6619 1437.0388 1441.0261 1480.0719 1580.0961 1604.4042 1623.4733 2987.5704 3052.9139 3130.4604 3138.2946 3149.0586 3159.4118 3171.0737
redmass: 6.2698 2.8491 4.1007 5.9102 10.5116 7.4678 2.8115 3.3245 6.7097 2.6179 6.4425 7.1592 1.8396 1.6616 6.1430 1.2519 1.3799 7.5286 6.2278 1.4152 1.8819 1.4318 2.4282 3.7396 1.6269 1.0655 1.1254 1.0725 3.1134 1.3354 1.4483 9.2180 2.2400 1.0932 2.1592 6.3051 6.2798 8.6998 1.0553 1.1065 1.0852 1.0880 1.0921 1.0963 1.1016
irintensity: 0.9550 12.6737 1.1897 2.5920 2.6177 0.6989 0.0258 0.3907 1.5658 14.0389 0.1129 20.6475 50.8744 57.3802 6.4095 0.7293 1.8599 105.8120 2.6396 0.2174 0.7279 0.7780 0.5496 24.3116 11.7751 2.1185 9.6070 0.2391 128.7799 1.9770 21.4815 1.8919 19.1675 8.2194 0.2321 48.1091 58.8083 58.0192 28.3578 16.5775 1.6436 4.3946 14.9726 18.9725 19.0511
temp: 298.150 k
press: 1.00000 atm
elementType: 9 8 6 6 6 6 6 6 6 6 1 1 1 1 1 1 1
symmnumber: 1
zpe: 335446.9 jmol-1
zpe.correction: 0.127765 hartree
zpe.thermalcorrener: 0.136422 hartree
zpe.thermalcorrenthalpy: 0.137366 hartree
zpe.thermalcorrgfe: 0.093245 hartree
zpe.sumelectzpe: -483.384378 hartree
zpe.sumelectthermal: -483.375721 hartree
zpe.sumelectthermalent: -483.374777 hartree
zpe.sumelectthermalfe: -483.418898 hartree
dipole: 4.6150 -3.1423 0.0013
dipole: 5.5832
quadrupole: -62.9880 -53.5202 -59.1255
quadrupole: 6.1545 0.0019 0.0058
quadrupole: -4.4434 5.0243 -0.5809 6.1545 0.0019 0.0058
hfenergy: -483.5121429 hartree
pointgroup: C01 [X(C8H7F1O1)]
dipole: -1.8287628 1.2168346 -0.0007453 debye
dipolederiv: -0.8376626 -0.0219423 0.0005362 0.0815427 -0.2145736 -0.0001417 0.0002444 -0.0000655 -0.2554003 -0.7931034 0.1175846 0.0002829 0.3611043 -0.7351746 0.0003297 -0.0004346 0.0008728 -0.2982606 -0.7479463 0.06122 0.0006185 0.0035743 -0.0801643 0.0000847 0.0008069 0.0000723 -0.0119321 0.1378082 0.0893573 -0.0005964 -0.0924762 0.0153848 -0.0002956 -0.0001712 -0.0005695 -0.1440513 0.0371617 -0.1428604 0.0002144 0.1020735 0.0221138 -0.0004736 -0.000317 -0.0001629 -0.0975322 1.5705671 -0.0486693 -0.0013135 -0.1511773 0.8218811 -0.0010227 -0.0009834 -0.0013672 0.1138876 -0.2044886 -0.1171719 0.0003772 -0.1800077 0.0960949 -0.0004894 0.0005587 -0.0005639 -0.1489243 -0.0527973 0.2018675 -0.0007059 0.1851577 0.0172888 -0.0007254 -0.0006703 -0.0007332 -0.1512761 0.1543094 -0.0220774 -0.0002936 0.0138566 0.0257934 -0.0004491 -0.0003706 -0.0004234 -0.1317426 0.6981583 -0.1385767 -0.0000025 -0.3349031 -0.0010066 0.0010164 0.0003551 0.0007979 0.4076414 0.0155164 -0.1091541 0.0004765 -0.1079103 -0.0202212 0.0005778 0.0004956 0.000597 0.1454271 0.1139725 0.0661274 -0.0001379 0.0177695 0.0117376 0.0003968 -0.0000262 0.0003194 0.1559599 0.0469945 0.0644831 -0.0000462 0.0825079 -0.0820352 0.000588 -0.0000935 0.000614 0.1607543 -0.0020136 -0.090895 0.0004515 -0.1029834 -0.0307892 0.0006694 0.0004863 0.0006701 0.1595522 -0.1094142 0.0267081 0.0002514 0.027254 0.0916479 0.0001579 0.0002531 0.0001576 0.1586995 -0.0135195 0.0320209 0.0407279 0.0473945 0.0307332 -0.0674518 0.0639838 -0.0909829 -0.0312034 -0.0135426 0.0319782 -0.0408405 0.0472228 0.0312894 0.0672289 -0.0641172 0.0907675 -0.0315993 unknown
polarizability: 122.4318625|-4.5405019|93.9281034|-0.0834388|-0.1396462|39.2829211 unknown
InChI: InChI=1S/C8H7FO/c9-6-8(10)7-4-2-1-3-5-7/h1-5H,6H2
charge 0 multiplicity 1
17 atoms
F  3.674012 0.467262 -0.005739
O  1.845335 -1.528285 -0.000439
C  -0.10971 -0.103961 -0.001614
C  -0.661497 1.207043 -0.004567
C  -0.983705 -1.225566 0.002614
C  1.3697 -0.363017 -0.002636
C  -2.060917 1.388769 -0.003365
C  -2.379606 -1.041803 0.003853
C  -2.921876 0.266617 0.000853
C  2.291687 0.868297 -0.005596
H  -0.013906 2.091074 -0.007827
H  -0.538108 -2.22608 0.004862
H  -2.480854 2.400334 -0.00572
H  -3.046292 -1.910718 0.007157
H  -4.007958 0.410693 0.001773
H  2.116399 1.482805 0.898721
H  2.115398 1.479636 -0.91183
