program: Gaussian 09
title: 000144955
version: EM64L-G09RevD.01
frameworkgroup: C1[X(C14H23N)]
method: RPBEPBE
basis: SDD
operation: Freq
keyword: #pfreq=noraman
keyword: PBEPBE/SDD
title: #p freq=noraman PBEPBE/SDD
converged: YES YES NO NO
title: Mulliken charges:
elementType: N C C C C C C C C C C C C C C H H H H H H H H H H H H H H H H H H H H H H H
charge: -0.254044 0.038407 0.423633 0.424346 -0.354965 -0.354584 -0.550081 -0.549993 -0.408573 -0.408360 -0.276667 -0.682804 -0.682404 -0.691551 -0.691536 0.192141 0.225161 0.192090 0.225021 0.247467 0.211117 0.247262 0.211071 0.228315 0.228267 0.220442 0.226215 0.207242 0.209211 0.226205 0.207308 0.209140 0.221858 0.215046 0.215875 0.221770 0.215032 0.215920
chargesum: 0.00000
title: Mulliken charges with hydrogens summed into heavy atoms:
elementType: N C C C C C C C C C C C C C C
charge: -0.254044 0.038407 0.423633 0.424346 0.062337 0.062528 -0.091497 -0.091659 -0.180258 -0.180093 -0.056225 -0.040136 -0.039751 -0.038773 -0.038814
polarizability: 1.78925542e+02 -4.19993006e-04 1.81607683e+02 -6.56111827e+00 -3.68913526e-02 1.19289422e+02
1716.lowfreq: -32.1932 -14.4179 -12.8451 -11.7990 0.0003 0.0006 0.0007 36.8887 54.8114
frequency: -31.1046 36.8741 54.6471 63.2209 99.0169 102.8979 128.4314 135.4591 154.8507 192.4143 203.2609 209.4935 227.9398 260.1891 271.1405 298.3928 301.4154 302.0642 344.3076 386.9108 453.7766 483.8385 522.7478 540.3115 561.3383 563.8034 648.2739 744.6165 758.6235 773.1835 775.6466 786.7706 789.9349 800.7743 861.2832 891.2840 905.9277 916.1632 967.3295 969.8012 998.7357 1005.8297 1029.9645 1056.7501 1058.7796 1064.0139 1066.0649 1074.8429 1094.5827 1104.6401 1142.7893 1176.1559 1206.5751 1226.4168 1237.0169 1251.4411 1256.8357 1262.0076 1298.8899 1304.7454 1314.8939 1343.1912 1359.8562 1360.3067 1374.6369 1374.9176 1377.1938 1388.7088 1389.5392 1445.6049 1451.2580 1453.7601 1464.1973 1466.8971 1469.7032 1472.1860 1472.5639 1476.5243 1478.2766 1480.8177 1484.7054 1487.5311 1488.1288 1580.4149 1595.9099 2937.0537 2944.5850 2973.1144 2973.8854 2975.8775 2976.2610 2980.5682 2981.1105 3045.1673 3047.0150 3052.3384 3052.8367 3067.8746 3068.6785 3071.6657 3072.2157 3080.0862 3080.5754 3084.5842 3086.9253 3105.0336 3111.3209 3147.1765
redmass: 2.8607 2.5568 3.3594 3.0387 2.5198 2.6435 2.1541 3.2352 2.2295 1.1343 1.1698 1.1382 1.6999 1.6112 2.2297 2.2382 2.9449 3.0332 2.1520 2.6392 3.2380 3.2792 3.2325 5.1491 3.1463 3.1314 3.2145 3.7146 1.6025 1.3685 1.2333 1.1776 1.1881 2.2116 2.8006 2.5710 1.3744 1.9969 2.1875 1.3414 1.8168 2.9817 1.8233 2.2383 2.3103 1.9719 1.8250 1.6296 1.6769 1.6523 1.9474 1.1433 3.7460 1.9626 1.3859 1.5160 1.5609 1.5777 1.2239 1.4676 1.6538 1.2222 4.4245 1.2810 1.2131 1.2145 1.7656 1.2005 1.2073 2.2624 1.2732 1.7649 1.1519 1.0452 1.0780 1.0453 1.0460 1.0601 1.0723 1.0588 1.1048 1.0944 1.0980 7.0900 5.8974 1.0683 1.0684 1.0353 1.0358 1.0352 1.0354 1.0662 1.0658 1.0927 1.0936 1.0946 1.0945 1.0977 1.0978 1.0996 1.0996 1.0994 1.0995 1.1011 1.1009 1.0856 1.0914 1.0985
irintensity: 0.8851 0.0222 0.3155 0.4689 0.0095 0.3481 2.6215 0.5485 2.0813 0.1631 0.7723 0.2636 0.6635 0.1368 0.0119 0.2642 0.1350 2.6082 0.8152 8.2296 12.3279 1.0775 4.6948 0.5369 3.9501 0.0057 0.4623 0.2416 28.3765 1.7555 1.3549 4.7193 21.4625 28.3277 14.9433 0.0100 0.2720 9.0584 1.2188 0.1865 3.1677 11.7118 12.7133 6.3433 25.9891 0.1062 26.6228 0.6721 12.5780 20.0618 7.0920 2.0055 56.8436 3.8195 0.4872 0.3275 5.2686 51.4581 13.2585 1.0529 5.2370 15.3614 0.7675 4.4440 21.6760 19.3114 12.9653 21.0335 3.9484 109.3785 9.6721 0.4181 0.1362 3.4216 5.7728 5.6650 11.1731 0.0850 9.9940 11.9482 22.6489 19.3914 0.2176 3.7053 4.2843 67.9638 45.5801 39.0067 34.9473 61.4418 26.9691 46.7577 12.6567 0.7985 9.8552 1.4676 0.7398 90.9118 16.9839 63.3144 41.3101 27.9474 91.6681 17.7555 67.8870 2.0724 34.1580 36.6665
temp: 298.150 k
press: 1.00000 atm
elementType: 7 6 6 6 6 6 6 6 6 6 6 6 6 6 6 1 1 1 1 1 1 1 1 1 1 1 1 1 1 1 1 1 1 1 1 1 1 1
symmnumber: 1
zpe: 881486.9 jmol-1
zpe.correction: 0.335741 hartree
zpe.thermalcorrener: 0.352505 hartree
zpe.thermalcorrenthalpy: 0.353449 hartree
zpe.thermalcorrgfe: 0.291812 hartree
zpe.sumelectzpe: -600.849225 hartree
zpe.sumelectthermal: -600.832460 hartree
zpe.sumelectthermalent: -600.831516 hartree
zpe.sumelectthermalfe: -600.893154 hartree
dipole: -0.0026 -0.9900 0.0062
dipole: 0.9900
quadrupole: -89.2831 -89.9572 -96.1673
quadrupole: 0.0035 -0.8956 -0.0054
quadrupole: 2.5194 1.8454 -4.3648 0.0035 -0.8956 -0.0054
hfenergy: -601.1849656 hartree
pointgroup: C01 [X(C14H23N1)]
dipole: -0.3872346 -0.0418146 0.0022167 debye
polarizability: 181.5775483|0.2768285|179.0661727|0.6317893|-6.0040545|119.1789259 unknown
InChI: InChI=1S/C14H23N/c1-5-12-10-9-11-13(6-2)14(12)15(7-3)8-4/h9-11H,5-8H2,1-4H3
charge 0 multiplicity 1
38 atoms
N  -1.265678 -0.140699 -0.002252
C  0.161706 0.018225 -0.002291
C  1.018297 -1.13537 -0.024737
C  0.745137 1.331191 0.021803
C  -1.959348 -0.747147 1.146705
C  -2.077897 0.300857 -1.148891
C  0.469659 -2.557319 -0.099763
C  -0.100647 2.598633 0.102304
C  2.423389 -0.955294 -0.01391
C  2.155753 1.462903 0.009014
C  2.997913 0.332282 -0.003359
C  -2.634834 0.282511 2.088675
C  -2.512649 -0.851249 -2.091046
C  0.735109 -3.398171 1.17783
C  -0.028701 3.481757 -1.172273
H  -2.725855 -1.470025 0.791516
H  -1.224653 -1.331355 1.72838
H  -2.983562 0.836401 -0.789863
H  -1.491258 1.033245 -1.731092
H  -0.612995 -2.524788 -0.30999
H  0.945068 -3.075625 -0.956703
H  -1.14963 2.330821 0.314725
H  0.252216 3.205466 0.960428
H  3.072386 -1.840228 -0.042252
H  2.595184 2.468499 0.037201
H  4.087088 0.452822 -0.004295
H  -1.882603 0.969893 2.5152
H  -3.388044 0.886901 1.54989
H  -3.149821 -0.232125 2.922853
H  -1.628427 -1.356496 -2.518898
H  -3.113845 -1.606149 -1.551305
H  -3.129153 -0.461622 -2.92409
H  1.818167 -3.477234 1.384009
H  0.335079 -4.422994 1.064832
H  0.26278 -2.94305 2.067597
H  1.01013 3.7975 -1.379338
H  -0.643873 4.393154 -1.054383
H  -0.391286 2.937277 -2.063231
