program: Gaussian 09
title: 000144950
version: EM64L-G09RevD.01
frameworkgroup: C1[X(C13H19N)]
method: RPBEPBE
basis: SDD
operation: Freq
keyword: #pfreq=noraman
keyword: PBEPBE/SDD
title: #p freq=noraman PBEPBE/SDD
converged: YES YES NO NO
title: Mulliken charges:
elementType: N C C C C C C C C C C C C C H H H H H H H H H H H H H H H H H H H
charge: -0.227786 -0.371903 -0.373585 -0.479093 0.097910 0.323736 0.405410 -0.474479 -0.558058 -0.397608 -0.445044 -0.278136 -0.718862 -0.694272 0.206102 0.221385 0.228718 0.205608 0.234842 0.227917 0.211207 0.225284 0.216975 0.215383 0.233156 0.224429 0.219815 0.214479 0.223218 0.209366 0.227043 0.211502 0.235341
chargesum: 0.00000
title: Mulliken charges with hydrogens summed into heavy atoms:
elementType: N C C C C C C C C C C C C C
charge: -0.227786 0.055583 0.060741 -0.016334 0.097910 0.323736 0.405410 -0.037988 -0.125700 -0.164452 -0.220616 -0.058321 -0.071798 -0.020386
polarizability: 1.75737820e+02 8.18208258e+00 1.71861279e+02 5.48258341e+00 -3.69439825e+00 9.59565432e+01
1716.lowfreq: -10.6713 -0.0005 -0.0004 0.0005 2.6965 7.3229 47.3256 66.6847 81.2124
frequency: 47.1779 66.6462 81.1731 121.6540 131.8332 153.0346 173.2496 178.8368 205.6971 237.5607 253.9176 287.0244 317.4527 338.8248 359.1328 399.5897 503.2705 527.2604 550.1793 560.4651 605.5642 728.1210 744.3137 762.5943 765.3018 789.1032 817.9220 850.5352 863.2591 869.7922 902.7904 943.8695 953.4521 960.7398 973.8498 1008.8547 1020.6668 1045.3254 1063.2730 1075.5928 1082.5990 1098.0992 1105.2468 1108.3140 1121.8818 1166.2787 1178.0774 1192.6892 1230.3845 1234.2682 1240.2323 1255.6772 1260.9225 1279.1731 1302.5841 1308.6187 1324.8689 1341.4813 1371.7656 1382.2154 1393.8335 1448.2457 1452.2461 1467.0594 1468.9368 1471.6127 1480.2674 1481.2574 1490.5522 1494.0526 1498.5577 1510.3391 1579.7293 1600.7501 2936.9571 2948.9975 2958.5794 2978.5580 2980.3983 2989.7528 2998.9536 3013.1683 3021.9824 3032.8327 3047.5340 3072.0887 3073.9444 3079.6816 3082.6399 3110.0791 3120.1109 3134.5345 3157.3972
redmass: 3.3010 2.4363 2.3006 2.8997 2.5295 2.1277 2.7854 2.6667 1.1141 2.3138 2.8955 1.5346 3.0036 2.6002 3.7571 3.5495 3.4404 3.9561 3.7039 3.5768 3.5008 3.4055 2.2824 1.2271 1.4892 1.1854 1.5129 1.1716 3.0853 2.9823 1.3424 2.9857 2.6541 1.3376 2.2079 1.7274 4.8468 1.8721 1.9370 2.8388 1.5569 1.4775 1.2666 2.5805 1.6268 1.3533 1.1725 1.1904 2.6958 1.3852 1.3863 1.2813 1.2950 1.4563 1.6463 1.5133 1.8739 2.8758 3.4752 1.2109 1.2167 2.5138 1.8431 1.0849 1.1743 1.2720 1.0987 1.0611 1.0532 1.0926 1.0908 1.1070 7.2834 5.6679 1.0651 1.0623 1.0601 1.0351 1.0358 1.0601 1.0961 1.1043 1.0954 1.0996 1.0618 1.0990 1.0995 1.1003 1.1004 1.0873 1.1083 1.0894 1.0981
irintensity: 0.1915 1.2462 0.9215 4.2198 0.6665 3.5089 4.1281 0.7581 0.3418 3.5997 0.1125 0.0974 3.5868 2.0665 3.2415 3.1271 0.8397 2.7299 1.9567 0.8098 2.2318 1.3742 12.7706 39.6736 0.5241 4.7176 23.4263 4.2050 5.9812 4.6881 0.4615 7.2253 2.6188 0.9373 3.6973 1.7357 0.6237 11.4652 2.9035 13.4801 0.5288 10.2576 13.5774 9.9902 16.2492 2.0177 0.4577 3.6849 0.3429 1.6939 17.8063 1.2157 5.1227 0.0980 6.9546 12.4089 0.7760 84.0953 4.2276 13.0878 9.2532 133.3329 24.7846 5.0158 5.6248 2.0558 9.7117 10.5071 12.2015 7.9076 15.8338 4.0435 0.7917 11.8904 96.0225 39.6104 104.3760 41.3882 35.1042 41.8910 9.1261 46.6664 46.1574 12.5969 65.3922 45.6006 50.5662 42.1369 43.8075 14.1861 36.5274 18.9033 34.5234
temp: 298.150 k
press: 1.00000 atm
elementType: 7 6 6 6 6 6 6 6 6 6 6 6 6 6 1 1 1 1 1 1 1 1 1 1 1 1 1 1 1 1 1 1 1
symmnumber: 1
zpe: 756039.3 jmol-1
zpe.correction: 0.287960 hartree
zpe.thermalcorrener: 0.302269 hartree
zpe.thermalcorrenthalpy: 0.303214 hartree
zpe.thermalcorrgfe: 0.247095 hartree
zpe.sumelectzpe: -560.424221 hartree
zpe.sumelectthermal: -560.409912 hartree
zpe.sumelectthermalent: -560.408967 hartree
zpe.sumelectthermalfe: -560.465086 hartree
dipole: -1.3696 -1.5231 0.1770
dipole: 2.0560
quadrupole: -80.6675 -80.4421 -88.3832
quadrupole: 0.3403 1.4195 -0.4769
quadrupole: 2.4967 2.7222 -5.2189 0.3403 1.4195 -0.4769
hfenergy: -560.712181 hartree
pointgroup: C01 [X(C13H19N1)]
dipole: 0.6647369 -0.4471855 -0.111525 debye
polarizability: 179.0338727|-7.1862517|166.1967719|5.2180327|13.2099669|98.3249975 unknown
InChI: InChI=1S/C13H19N/c1-3-11-7-5-8-12(4-2)13(11)14-9-6-10-14/h5,7-8H,3-4,6,9-10H2,1-2H3
charge 0 multiplicity 1
33 atoms
N  1.031998 -0.843007 0.133409
C  1.520509 -1.754159 -0.945111
C  2.282761 -0.967033 0.93603
C  2.746337 -2.106965 -0.035166
C  -0.049257 0.073067 0.157304
C  -1.37344 -0.422717 -0.12804
C  0.128849 1.462638 0.48189
C  -1.591325 -1.912464 -0.382996
C  1.496344 2.104528 0.695073
C  -2.466461 0.473517 -0.112576
C  -1.007529 2.30779 0.529385
C  -2.298057 1.833752 0.222173
C  -3.040768 -2.419841 -0.230298
C  2.347014 2.157018 -0.601816
H  1.792217 -1.222464 -1.882722
H  0.855982 -2.59809 -1.202719
H  2.112769 -1.255177 1.990725
H  2.961232 -0.090383 0.914701
H  3.737405 -1.965605 -0.492005
H  2.682946 -3.113309 0.406805
H  -1.237191 -2.177257 -1.401836
H  -0.930921 -2.46907 0.312427
H  1.343021 3.139349 1.055337
H  2.069607 1.592076 1.490575
H  -3.471387 0.097154 -0.329729
H  -0.862109 3.364999 0.785691
H  -3.159679 2.509761 0.248483
H  -3.071807 -3.519053 -0.344224
H  -3.452448 -2.167386 0.76379
H  -3.713482 -1.991579 -0.995824
H  1.825438 2.741245 -1.381191
H  3.329011 2.630028 -0.413416
H  2.522119 1.144438 -1.006833
