program: Gaussian 09
title: 000144917
version: EM64L-G09RevD.01
frameworkgroup: C1[X(C5H6FN7O12)]
method: RPBEPBE
basis: SDD
operation: Freq
keyword: #p
keyword: freq=noraman
keyword: PBEPBE/SDD
title: #p freq=noraman PBEPBE/SDD
converged: YES YES NO NO
title: Mulliken charges:
elementType: F O O O O O O O O O O O O N N N N N N N C C C C C H H H H H H
charge: -0.118770 -0.148799 -0.134004 -0.167488 -0.122213 -0.123201 -0.116017 -0.175185 -0.184706 -0.144602 -0.131722 -0.117684 -0.135420 -0.046634 0.096084 0.116376 0.113820 0.149976 0.091329 0.104847 -0.429770 -0.406959 0.306165 -0.487074 0.391366 0.305036 0.307236 0.292163 0.280556 0.333496 0.301797
chargesum: 0.00000
title: Mulliken charges with hydrogens summed into heavy atoms:
elementType: F O O O O O O O O O O O O N N N N N N N C C C C C
charge: -0.118770 -0.148799 -0.134004 -0.167488 -0.122213 -0.123201 -0.116017 -0.175185 -0.184706 -0.144602 -0.131722 -0.117684 -0.135420 -0.046634 0.096084 0.116376 0.113820 0.149976 0.091329 0.104847 0.182501 0.165761 0.306165 0.148219 0.391366
polarizability: 1.90771516e+02 -2.35591597e+00 1.54774367e+02 8.07618415e+00 5.73723917e-01 1.37015140e+02
1716.lowfreq: -5.3729 -0.0007 -0.0004 -0.0003 5.3239 7.7708 13.0015 17.8979 21.4786
frequency: 12.8730 17.8461 21.4151 33.1640 36.4695 38.0617 48.0822 66.8668 72.3247 81.4609 84.3542 106.1298 125.9805 139.8412 156.3965 161.5378 168.6926 190.8536 215.7258 224.8635 259.9722 274.0650 295.7507 307.2432 329.4959 339.1300 345.1212 357.3196 362.8026 386.0823 401.0675 426.8911 490.1369 503.5389 558.8258 576.3005 592.5627 600.1151 625.6304 668.3129 682.3555 683.8561 697.9615 717.2319 720.8665 745.8506 755.0543 765.0786 783.5158 814.1088 823.3933 850.3665 904.6424 968.2083 1022.8165 1037.3890 1111.8436 1125.5014 1141.2492 1149.7571 1157.9453 1162.8752 1164.6823 1205.3052 1211.9473 1218.3284 1272.8504 1302.2565 1319.0793 1341.8123 1348.9159 1378.1524 1414.9280 1430.6687 1432.8551 1439.2279 1441.3258 1445.9779 1448.8968 1453.9574 1464.3280 3022.4908 3028.3243 3031.2716 3087.4819 3102.0797 3113.3496
redmass: 12.6207 13.3009 15.0266 15.1882 14.2908 15.3996 12.7436 9.8470 14.2195 10.6296 14.7287 13.6696 9.3128 11.6431 9.9378 10.4738 11.8227 10.0651 8.2985 6.1983 3.3899 6.1553 13.0241 8.2361 11.8165 6.3600 11.7902 8.5540 6.9881 11.7210 2.4563 10.6524 8.5133 4.7792 6.7851 10.0402 6.6098 7.7911 9.2195 12.7328 9.4970 4.5521 5.9710 13.2558 12.1729 3.8513 9.2729 11.6680 9.8241 3.5994 2.9154 7.4275 4.2766 4.1787 4.2490 2.6629 3.2533 6.2630 6.7130 8.0899 13.8262 14.1687 13.7099 8.9605 2.3516 8.3499 1.4001 1.6415 1.3509 1.2413 1.2602 1.2895 1.3453 4.3164 3.6564 7.6489 7.0805 2.8262 6.9401 2.2642 1.2318 1.0613 1.0609 1.0607 1.1014 1.1016 1.1029
irintensity: 1.1279 0.9055 0.0496 0.3838 0.2529 0.0823 1.1693 3.2653 1.2972 1.7746 0.0087 0.9904 1.3223 1.0230 5.5088 3.1154 3.3092 2.3821 4.4487 6.2002 1.8722 0.2180 3.0352 0.5437 1.5809 5.0980 4.0369 1.3204 1.8965 3.9591 2.1119 1.3613 8.6533 9.6341 0.1700 1.8272 12.2150 6.2105 8.6330 5.3517 7.9960 6.1111 7.7892 54.7974 65.2673 65.8593 23.0298 12.2455 19.7529 21.2450 12.3903 19.6876 14.9904 102.2187 12.7209 13.7050 13.1585 46.9738 71.6532 157.8138 111.3471 59.5553 226.0358 33.7443 6.4406 9.9750 3.8587 24.7249 84.4436 3.0195 10.9329 23.4965 89.0185 165.4854 57.8645 36.3860 242.9520 22.0302 269.0212 31.4681 42.7109 10.0355 11.4528 10.4554 6.5772 7.0976 5.3471
temp: 298.150 k
press: 1.00000 atm
elementType: 9 8 8 8 8 8 8 8 8 8 8 8 8 7 7 7 7 7 7 7 6 6 6 6 6 1 1 1 1 1 1
symmnumber: 1
zpe: 446480.2 jmol-1
zpe.correction: 0.170055 hartree
zpe.thermalcorrener: 0.195251 hartree
zpe.thermalcorrenthalpy: 0.196195 hartree
zpe.thermalcorrgfe: 0.109299 hartree
zpe.sumelectzpe: -1577.404043 hartree
zpe.sumelectthermal: -1577.378847 hartree
zpe.sumelectthermalent: -1577.377903 hartree
zpe.sumelectthermalfe: -1577.464799 hartree
dipole: -1.1498 0.1179 -3.2917
dipole: 3.4888
quadrupole: -170.4572 -162.5447 -146.2651
quadrupole: 1.5268 5.6429 -3.5423
quadrupole: -10.7015 -2.7890 13.4905 1.5268 5.6429 -3.5423
hfenergy: -1577.5740983 hartree
pointgroup: C01 [X(C5H6F1N7O12)]
dipole: -0.4559789 -0.0971472 1.2909852 debye
polarizability: 190.5646501|4.1371637|155.0355224|-7.7445765|0.6596617|136.9608514 unknown
InChI: InChI=1S/C5H6FN7O12/c6-4(8(14)15,9(16)17)3-7(13(24)25)2-1-5(10(18)19,11(20)21)12(22)23/h1-3H2
charge 0 multiplicity 1
31 atoms
F  -1.544144 1.488882 0.086883
O  3.416417 -1.650253 0.864339
O  2.59636 0.763801 -2.449941
O  1.423541 1.922136 1.429675
O  4.035675 0.358171 1.775428
O  4.543376 0.285723 -1.343918
O  2.882954 2.743027 -0.125238
O  -0.01393 -3.240131 -0.254243
O  -2.305748 -3.055822 -0.225038
O  -4.534914 0.705488 1.51649
O  -3.979253 -0.366398 -1.641515
O  -4.149037 2.339863 -0.046929
O  -1.785973 0.09068 -2.141385
N  -0.984413 -1.331414 0.602163
N  3.385651 -0.37511 0.959958
N  3.286261 0.470241 -1.418335
N  2.237653 1.808502 0.44668
N  -1.113961 -2.629895 0.00479
N  -3.8788 1.256506 0.565832
N  -2.804362 0.050227 -1.374356
C  1.148182 -0.413422 -0.339019
C  0.373777 -0.866521 0.93402
C  2.446839 0.339281 -0.074954
C  -2.206975 -0.659605 1.031138
C  -2.56905 0.518922 0.10886
H  1.400559 -1.313219 -0.927576
H  0.510557 0.228247 -0.972207
H  0.92178 -1.688665 1.427704
H  0.257681 -0.029029 1.638542
H  -3.037572 -1.384392 1.035313
H  -2.084735 -0.258923 2.053139
