program: Gaussian 09
title: 000144898
version: EM64L-G09RevD.01
frameworkgroup: C1[X(C10H18O)]
method: RPBEPBE
basis: SDD
operation: Freq
keyword: #pfreq=noraman
keyword: PBEPBE/SDD
title: #p freq=noraman PBEPBE/SDD
converged: NO YES NO NO
title: Mulliken charges:
elementType: O C C C C C C C C C C H H H H H H H H H H H H H H H H H H
charge: -0.463659 0.312119 -0.638684 -0.565180 -0.742627 0.579337 0.484720 -0.833988 -0.820986 -0.747919 -0.723142 0.208947 0.227988 0.208107 0.217065 0.205610 0.247591 0.229931 0.337240 0.210377 0.266513 0.219822 0.222125 0.229678 0.245238 0.217918 0.219705 0.222265 0.223889
chargesum: 0.00000
title: Mulliken charges with hydrogens summed into heavy atoms:
elementType: O C C C C C C C C C C
charge: -0.126420 0.312119 -0.201749 -0.140008 -0.059495 0.579337 0.484720 -0.137276 -0.123945 -0.310297 -0.276987
polarizability: 1.30041132e+02 -5.25481924e+00 1.05136380e+02 1.01169819e+01 9.68667019e-01 1.00063569e+02
1716.lowfreq: -13.9273 -11.7740 -7.3636 0.0003 0.0004 0.0007 30.3127 45.4072 85.9437
frequency: 30.0757 45.1999 85.8802 92.4240 159.6622 171.0963 199.4718 204.3881 208.3488 265.4024 284.5573 335.0239 367.6758 385.2500 406.1928 418.5698 434.1524 441.7452 458.4047 515.3560 603.0469 669.2901 718.5003 766.7161 819.2788 836.4605 871.5461 894.0965 917.1214 930.8278 938.6731 940.4184 975.5395 983.4797 1010.4538 1018.9845 1044.6229 1050.3371 1079.7049 1104.4717 1138.5600 1182.8299 1243.2251 1262.0071 1290.9340 1298.6687 1313.1212 1359.2613 1388.2416 1390.2027 1393.2103 1425.3809 1428.2533 1451.2849 1454.3666 1457.3600 1461.0545 1466.0945 1474.9766 1484.8456 1485.8658 1660.5510 1662.3087 2953.5049 2965.3796 2966.3124 2988.5919 2993.1509 3030.3032 3044.9883 3047.0328 3051.0823 3084.3203 3085.6273 3086.7213 3087.3989 3089.5047 3102.5494 3186.6687 3189.1805 3526.0625
redmass: 2.9507 3.3799 2.6153 3.1788 2.1306 2.7902 1.1791 1.0659 1.2401 3.4114 2.8972 3.0597 2.2748 2.0421 1.7448 1.9270 1.5669 2.1389 2.0674 2.8442 2.0761 1.3187 1.3083 2.4628 2.8420 3.2575 2.3298 1.8864 1.7864 1.5619 1.3247 1.4360 1.6362 1.5732 1.4488 1.4606 1.5188 1.5029 1.8425 1.5670 1.8110 1.2812 1.7356 1.3948 2.8465 1.9082 1.5927 1.6800 1.2219 1.2758 1.2582 1.1817 1.1884 1.0893 1.0564 1.0515 1.0670 1.0790 1.0511 1.0619 1.0636 4.7761 4.7611 1.0618 1.0386 1.0373 1.0557 1.0396 1.0969 1.0953 1.0937 1.1024 1.0643 1.0977 1.0982 1.0647 1.0991 1.0997 1.1139 1.1140 1.0653
irintensity: 0.3304 0.3366 0.4617 1.4767 0.0778 1.4022 6.4861 1.6279 3.6400 3.0559 1.2394 0.4685 7.3972 17.8481 63.6845 19.4391 99.5502 24.1191 6.7428 8.4000 13.0420 1.5789 2.5730 10.0880 6.3705 1.9894 9.9540 2.1826 5.8103 20.9688 82.1124 59.3226 0.8373 0.5791 3.0341 4.0008 17.2643 1.7889 29.7269 5.5886 17.2005 34.2166 33.3612 16.8902 21.9605 3.5705 13.7989 18.7769 25.4126 30.7809 30.7580 2.1431 0.0433 2.4620 3.7412 13.0881 13.9426 19.6305 12.7760 11.8407 18.3845 20.6308 29.3476 20.2692 30.2842 25.0615 11.3064 29.3122 22.2690 16.0520 22.0045 22.2036 13.3133 27.3077 17.3546 3.9730 25.8963 23.1193 28.3619 28.1752 3.3041
temp: 298.150 k
press: 1.00000 atm
elementType: 8 6 6 6 6 6 6 6 6 6 6 1 1 1 1 1 1 1 1 1 1 1 1 1 1 1 1 1 1
symmnumber: 1
zpe: 665921.8 jmol-1
zpe.correction: 0.253636 hartree
zpe.thermalcorrener: 0.267546 hartree
zpe.thermalcorrenthalpy: 0.268491 hartree
zpe.thermalcorrgfe: 0.213351 hartree
zpe.sumelectzpe: -466.150167 hartree
zpe.sumelectthermal: -466.136257 hartree
zpe.sumelectthermalent: -466.135312 hartree
zpe.sumelectthermalfe: -466.190452 hartree
dipole: 0.9408 -0.6160 -0.6860
dipole: 1.3172
quadrupole: -69.6671 -70.0308 -70.2753
quadrupole: -0.3292 1.2584 -3.8688
quadrupole: 0.3240 -0.0397 -0.2842 -0.3292 1.2584 -3.8688
hfenergy: -466.4038029 hartree
pointgroup: C01 [X(C10H18O1)]
dipole: -0.3804918 -0.1844707 0.2996143 debye
polarizability: 129.3762008|7.2458186|104.5773742|9.8704726|-1.6183565|101.2875062 unknown
InChI: InChI=1S/C10H18O/c1-8(2)6-10(5,11)7-9(3)4/h11H,1,3,6-7H2,2,4-5H3
charge 0 multiplicity 1
29 atoms
O  -0.167844 0.243736 -1.487349
C  -0.009899 0.663435 -0.068246
C  0.866668 -0.375409 0.709292
C  -1.4268 0.783534 0.612539
C  0.652689 2.045847 -0.144144
C  2.310925 -0.535446 0.245009
C  -2.394769 -0.34834 0.27071
C  2.54849 -1.199796 -1.099435
C  -3.318831 -0.095356 -0.909444
C  3.344178 -0.119263 1.027703
C  -2.439194 -1.507375 0.985292
H  0.865217 -0.07751 1.775347
H  0.347973 -1.356554 0.650191
H  -1.869442 1.744135 0.285889
H  -1.277022 0.844252 1.707025
H  0.721436 2.499551 0.861044
H  1.670755 1.972208 -0.56037
H  0.054342 2.709407 -0.792481
H  -0.532697 -0.679924 -1.488416
H  2.081529 -2.205048 -1.128827
H  2.083272 -0.609505 -1.909766
H  3.625931 -1.316362 -1.308413
H  -3.906447 -0.990736 -1.176828
H  -4.029599 0.720219 -0.669165
H  -2.743676 0.239806 -1.793057
H  3.175652 0.357244 2.001244
H  4.387931 -0.243673 0.715711
H  -1.803434 -1.669491 1.863832
H  -3.132835 -2.315988 0.725316
