program: Gaussian 09
title: 000144895
version: EM64L-G09RevD.01
frameworkgroup: C1[X(C7H2ClF3O)]
method: RPBEPBE
basis: SDD
operation: Freq
keyword: #p
keyword: freq=noraman
keyword: PBEPBE/SDD
title: #p freq=noraman PBEPBE/SDD
converged: NO YES NO NO
title: Mulliken charges:
elementType: Cl F F F O C C C C C C C H H
charge: -0.044663 -0.156979 -0.156751 -0.175460 -0.067279 0.066268 0.305823 0.374744 -0.531516 -0.522632 0.440620 -0.132844 0.301254 0.299416
chargesum: 0.00000
title: Mulliken charges with hydrogens summed into heavy atoms:
elementType: Cl F F F O C C C C C C C
charge: -0.044663 -0.156979 -0.156751 -0.175460 -0.067279 0.066268 0.305823 0.374744 -0.230262 -0.223216 0.440620 -0.132844
polarizability: 1.23866169e+02 1.57764540e+00 9.38570758e+01 -6.35426770e-01 4.78777196e+00 4.53130049e+01
1716.lowfreq: -12.4621 -7.1624 -4.4011 0.0009 0.0015 0.0016 45.9298 69.1883 148.2234
frequency: 45.9171 69.1776 148.2216 184.2504 213.9956 232.4985 272.4958 303.0096 335.1074 380.3948 435.1305 495.5006 523.1337 542.8945 568.4754 576.9662 621.8054 649.9797 752.1812 822.5953 841.1145 864.9607 973.9054 990.9910 1099.6569 1182.1338 1190.3246 1309.8439 1377.2899 1426.2814 1467.3000 1588.8184 1625.3173 1720.7833 3203.3606 3204.3184
redmass: 17.7985 18.0561 16.7381 17.7872 13.3231 5.1199 13.5720 14.8444 14.0104 13.3757 15.1860 7.9595 7.8980 15.2241 5.4651 6.9691 3.2992 6.0839 4.4150 6.9944 1.4450 1.8917 5.2222 11.2370 1.9354 1.6829 2.7789 12.3110 11.0710 5.2352 4.4699 9.6276 8.3933 13.1591 1.0940 1.0947
irintensity: 0.4616 0.6525 0.5458 0.9533 1.7298 0.0749 0.2172 3.9910 3.2655 6.8039 10.8689 9.8628 24.0920 0.8354 11.1272 52.4625 37.2157 3.3416 5.5011 133.5746 0.3163 98.6471 53.0455 78.0760 78.6611 16.9712 95.4919 33.6412 11.2653 65.8187 13.2982 129.9491 297.2081 288.3740 8.2683 2.6471
temp: 298.150 k
press: 1.00000 atm
elementType: 17 9 9 9 8 6 6 6 6 6 6 6 1 1
symmnumber: 1
zpe: 192838.8 jmol-1
zpe.correction: 0.073448 hartree
zpe.thermalcorrener: 0.083795 hartree
zpe.thermalcorrenthalpy: 0.084739 hartree
zpe.thermalcorrgfe: 0.036285 hartree
zpe.sumelectzpe: -1101.892396 hartree
zpe.sumelectthermal: -1101.882050 hartree
zpe.sumelectthermalent: -1101.881105 hartree
zpe.sumelectthermalfe: -1101.929559 hartree
dipole: 3.6110 -0.7113 -0.3533
dipole: 3.6973
quadrupole: -80.8018 -74.3981 -73.3181
quadrupole: 2.4228 1.3635 -2.0133
quadrupole: -4.6291 1.7746 2.8545 2.4228 1.3635 -2.0133
hfenergy: -1101.9658446 hartree
pointgroup: C01 [X(C7H2Cl1F3O1)]
dipole: -1.4447056 -0.1573378 0.0630217 debye
dipolederiv: -0.548361 0.2615945 -0.2483169 0.3824822 -0.4311282 0.3442102 -0.3039256 0.3345914 -0.4349529 -0.2847817 -0.2744463 -0.0347332 -0.1932199 -0.8171249 -0.0652268 -0.0298572 -0.0840957 -0.1237885 -0.3479121 0.3052353 0.0764926 0.2279135 -0.7225604 -0.1380353 0.0614836 -0.1199329 -0.1430007 -1.1699146 -0.0438927 0.028139 -0.0627812 -0.2136074 -0.0087418 0.0469895 -0.0035895 -0.1422352 -0.6549394 -0.2379051 0.1930193 -0.1444645 -0.6320141 0.4367055 -0.0368693 0.3523053 -0.5525433 -0.835686 0.0113545 -0.0252178 0.0480526 -0.40943 0.0464715 0.0154276 0.0307031 -0.1333388 0.7255247 0.3076088 0.0062485 -0.0612015 1.044493 0.0827584 0.0760924 0.1131732 0.1546444 0.7860863 -0.3012153 -0.1002358 0.0228856 0.9302855 0.1867484 -0.1840518 0.13787 0.1858498 -0.5037169 -0.2289802 -0.0270742 -0.2135522 -0.2934335 -0.0043198 -0.0029114 -0.0066581 -0.1760148 -0.5489432 0.2070596 0.0461044 0.1846072 -0.2315178 -0.0225081 0.0452713 -0.0197753 -0.1829235 1.4275197 0.0380623 -0.0454925 0.0616943 0.62308 0.05943 -0.0687437 0.0518823 0.1553731 1.7708784 -0.0496032 0.1237841 -0.2502238 0.9936618 -0.8862482 0.3638394 -0.7458064 0.9735909 0.0893164 0.019432 0.0064217 0.0163312 0.0828058 -0.0157898 0.0019464 -0.0193255 0.2111732 0.0949293 -0.0143044 0.0008606 -0.0185234 0.0764904 -0.0154541 0.0153087 -0.0213417 0.2081665 unknown
polarizability: 123.2593999|-3.6974035|93.9820158|3.4545489|-6.4421526|45.7948336 unknown
InChI: InChI=1S/C7H2ClF3O/c8-7(12)6-4(10)1-3(9)2-5(6)11/h1-2H
charge 0 multiplicity 1
14 atoms
Cl 2.980595 -0.998331 0.998714
F  0.374489 2.455235 0.194781
F  0.63746 -2.345216 -0.379894
F  -3.617686 -0.201779 0.115447
O  2.699812 1.054991 -0.763972
C  0.590428 0.059261 -0.065654
C  -0.234943 1.208442 0.077656
C  -0.093666 -1.179583 -0.168877
C  -1.633449 1.156551 0.152007
C  -1.489986 -1.297415 -0.114825
C  -2.227012 -0.113095 0.051678
C  2.066433 0.214836 -0.133489
H  -2.227588 2.062783 0.284722
H  -1.977585 -2.269581 -0.210894
