program: Gaussian 09
title: 000144892
version: EM64L-G09RevD.01
frameworkgroup: C1[X(C7H18ClPSi2)]
method: RPBEPBE
basis: SDD
operation: Freq
keyword: #p
keyword: freq=noraman
keyword: PBEPBE/SDD
title: #p freq=noraman PBEPBE/SDD
converged: YES YES NO NO
title: Mulliken charges:
elementType: Cl P Si Si C C C C C C C H H H H H H H H H H H H H H H H H H
charge: -0.305122 0.482864 1.373171 1.417895 -1.282619 -1.013663 -1.001429 -1.025185 -1.034240 -0.999773 -0.997040 0.251517 0.240423 0.246390 0.247470 0.240288 0.242088 0.246707 0.247183 0.240868 0.237047 0.245415 0.232801 0.233483 0.270502 0.230386 0.267734 0.233649 0.231189
chargesum: 0.00000
title: Mulliken charges with hydrogens summed into heavy atoms:
elementType: Cl P Si Si C C C C C C C
charge: -0.305122 0.482864 1.373171 1.417895 -1.282619 -0.275333 -0.271583 -0.290427 -0.318977 -0.265402 -0.264468
polarizability: 1.93905749e+02 8.76281877e+00 1.64886918e+02 -1.38181784e-01 1.55575996e-01 1.25431311e+02
1716.lowfreq: -15.6395 -10.7060 -6.6351 0.0004 0.0018 0.0023 16.2552 38.6607 79.5137
frequency: 14.5724 38.6517 79.4897 80.5802 104.1189 110.5458 114.6284 127.2829 131.9752 139.1089 147.9198 154.8183 162.9047 166.3346 181.9858 192.3389 203.5680 205.4665 224.0497 229.8635 265.9719 288.6230 380.9436 408.2488 435.4871 589.6773 612.2540 682.4515 686.3412 694.7483 695.9838 746.7097 749.7742 757.3455 803.8746 806.7172 815.4392 820.1746 900.2654 904.8488 906.3040 909.1952 910.4037 927.2302 1043.5180 1287.2333 1287.6871 1290.9833 1294.7875 1304.1758 1311.0924 1433.4347 1437.9533 1440.8256 1445.6015 1446.3788 1448.3557 1450.6122 1452.3509 1453.9331 1459.4717 1464.8026 1468.8481 2980.0677 2982.9395 2983.8148 2984.9145 2986.2667 2987.3209 3077.6167 3078.0862 3082.8059 3084.1462 3084.5910 3086.0868 3092.3223 3100.3534 3106.7666 3107.1463 3110.7151 3113.9419
redmass: 2.5859 3.0145 2.1855 1.3187 2.2224 1.2759 2.1295 2.0496 1.9339 1.2329 2.0186 2.7578 2.1076 1.2346 3.1848 2.2526 2.5948 2.5352 2.5992 2.1225 3.4643 3.6373 8.2795 11.8177 6.5077 4.2190 4.2492 3.3243 3.1682 3.2891 3.1560 1.1813 1.1847 3.0485 1.3543 1.4332 1.6066 1.3812 1.4504 1.4453 1.5096 1.4975 1.4815 1.4995 10.8516 1.1976 1.2016 1.1972 1.1925 1.1890 1.1855 1.0547 1.0532 1.0520 1.0526 1.0528 1.0495 1.0537 1.0506 1.0507 1.0497 1.0491 1.0476 1.0350 1.0343 1.0350 1.0346 1.0350 1.0351 1.0969 1.0967 1.0978 1.0974 1.0976 1.0972 1.0987 1.0993 1.0991 1.0974 1.0977 1.0984
irintensity: 0.0155 0.2982 0.4247 0.1085 0.7156 0.5170 0.8863 0.4795 0.3774 0.3848 0.8361 2.1881 0.2067 0.0318 1.6095 1.8922 1.5546 1.0965 3.5526 0.0459 12.5780 4.0286 19.0133 27.3000 25.4456 1.0284 5.5558 9.7648 10.0965 4.0128 14.6471 0.3720 0.3550 24.8061 2.0331 13.0648 31.0506 28.7220 75.1967 6.9521 303.1925 133.8204 41.9083 158.7893 144.4316 32.3429 10.9490 57.2160 36.9336 51.1375 15.5178 1.5826 0.7523 3.2599 1.4427 0.6261 8.2698 4.1030 14.1847 17.1984 2.8549 2.6584 26.3487 10.3252 14.8329 6.1458 23.9065 13.8958 22.3788 3.9104 22.6051 7.6781 39.3809 4.2498 17.2650 10.8872 22.8135 1.8680 14.1291 10.3302 3.6105
temp: 298.150 k
press: 1.00000 atm
elementType: 17 15 14 14 6 6 6 6 6 6 6 1 1 1 1 1 1 1 1 1 1 1 1 1 1 1 1 1 1
symmnumber: 1
zpe: 602685.6 jmol-1
zpe.correction: 0.229551 hartree
zpe.thermalcorrener: 0.249356 hartree
zpe.thermalcorrenthalpy: 0.250300 hartree
zpe.thermalcorrgfe: 0.180459 hartree
zpe.sumelectzpe: -1656.767635 hartree
zpe.sumelectthermal: -1656.747829 hartree
zpe.sumelectthermalent: -1656.746885 hartree
zpe.sumelectthermalfe: -1656.816726 hartree
dipole: 3.8816 2.1154 0.0030
dipole: 4.4206
quadrupole: -103.3115 -100.8113 -99.2534
quadrupole: -7.5148 0.0022 0.0040
quadrupole: -2.1861 0.3141 1.8720 -7.5148 0.0022 0.0040
hfenergy: -1656.9971854 hartree
pointgroup: C01 [X(C7H18Cl1P1Si2)]
dipole: -1.2318574 1.070894 -0.6003971 debye
polarizability: 186.4034818|-11.3233112|163.497486|11.7440067|-17.6234849|134.3230099 unknown
InChI: InChI=1S/C7H18PSi2.Cl/c1-9(2,3)7(8)10(4,5)6;/h1-6H3;
charge 0 multiplicity 1
29 atoms
Cl 2.458669 -2.251284 1.489048
P  0.181048 -1.918549 1.116973
Si -1.890328 0.0003 0.027939
Si 1.374198 0.907855 0.021365
C  -0.020156 -0.371525 0.428154
C  -2.441988 1.582702 0.953247
C  -2.081446 0.187553 -1.86803
C  -3.011299 -1.446481 0.60219
C  0.675322 2.548165 -0.688083
C  2.304801 1.347936 1.634137
C  2.525362 0.137277 -1.299467
H  -1.968999 2.491229 0.54531
H  -3.538723 1.696409 0.860118
H  -2.197685 1.513811 2.028379
H  -1.79416 -0.748431 -2.379711
H  -3.13821 0.402938 -2.115648
H  -1.46309 1.006029 -2.273196
H  -2.753511 -2.398066 0.103426
H  -2.956047 -1.605342 1.694203
H  -4.062541 -1.209448 0.349653
H  0.090762 3.108393 0.062399
H  1.533977 3.183522 -0.978971
H  0.051704 2.405985 -1.587647
H  1.607591 1.755032 2.388711
H  2.806018 0.462447 2.057903
H  3.068447 2.120059 1.421541
H  2.971988 -0.802193 -0.932917
H  1.968823 -0.074347 -2.230461
H  3.342176 0.843726 -1.540766
