program: Gaussian 09
title: 000144890
version: EM64L-G09RevD.01
frameworkgroup: C1[X(C12H19NO2S)]
method: RPBEPBE
basis: SDD
operation: Freq
keyword: #p
keyword: freq=noraman
keyword: PBEPBE/SDD
title: #p freq=noraman PBEPBE/SDD
converged: YES YES NO NO
title: Mulliken charges:
elementType: S O O N C C C C C C C C C C C C H H H H H H H H H H H H H H H H H H H
charge: 0.176323 -0.281571 -0.284699 -0.598601 -0.581643 -0.062015 0.635552 -0.492129 -0.539433 -0.696155 0.224247 -0.325949 0.199727 -0.840805 -0.535579 -0.521668 0.195031 0.248639 0.195270 0.244579 0.230652 0.236124 0.196134 0.282291 0.258240 0.271774 0.264202 0.261948 0.251777 0.220167 0.244681 0.227486 0.209185 0.229859 0.256356
chargesum: 0.00000
title: Mulliken charges with hydrogens summed into heavy atoms:
elementType: S O O N C C C C C C C C C C C C
charge: 0.176323 -0.281571 -0.284699 -0.068587 -0.137973 0.133255 0.635552 -0.492129 -0.294855 -0.033244 0.224247 -0.043658 0.199727 -0.062878 0.156755 0.173732
polarizability: 2.12030309e+02 9.86169551e+00 1.77142853e+02 -7.32400931e+00 4.44716447e+00 1.16777227e+02
1716.lowfreq: -10.1014 -5.2744 -0.0017 -0.0017 -0.0007 1.6220 36.8550 42.3450 55.5033
frequency: 36.5183 42.2936 55.4888 61.7130 63.3937 75.6722 109.3218 122.2649 146.6375 157.5994 184.3704 193.3132 203.1596 209.6701 229.6034 250.3740 270.6127 282.8032 304.4143 314.8444 349.9238 380.1855 416.5255 430.7390 451.7454 477.7539 515.6314 557.3133 597.9396 604.7696 639.9112 664.3291 715.2610 730.8421 767.4721 826.2877 862.4355 892.0923 901.6954 927.6194 957.6865 963.8543 972.7210 985.0142 996.2260 1019.0686 1063.4670 1111.4801 1112.0125 1129.2783 1136.5217 1153.4583 1160.7348 1172.8864 1222.1436 1226.5868 1249.6146 1263.9219 1283.5566 1334.7778 1344.1340 1355.8851 1369.6587 1375.6855 1386.8308 1426.1497 1441.3405 1443.0549 1453.1650 1454.5322 1460.6838 1466.4219 1467.4009 1470.9350 1472.3939 1480.9460 1486.8240 1557.2786 1596.1131 1631.8561 2847.5580 2961.4270 2963.7319 2971.9205 2978.9981 3004.5587 3050.5052 3067.9767 3072.4521 3080.1196 3099.2461 3124.0073 3125.2207 3125.4128 3131.3997 3142.2408 3167.6717 3452.4460 3583.6899
redmass: 3.2883 3.3685 3.1710 3.5392 3.0892 2.2265 3.8066 2.1834 1.1683 1.5779 2.2002 2.6939 1.2726 2.8667 1.6452 1.7394 2.2107 2.6917 3.4378 4.1527 4.2452 2.4781 3.6981 3.9327 2.5068 3.0431 5.2620 1.4274 4.3955 5.4680 7.1067 6.9556 5.5421 3.0867 4.8904 2.0877 1.9379 1.4160 1.4200 5.4338 1.9330 1.1826 8.1202 1.2835 1.6441 4.0977 1.6368 1.2401 1.2580 2.2170 2.5136 1.4165 1.7090 1.9215 1.5108 1.4067 1.3076 3.4252 1.5067 1.1564 1.3976 3.1787 5.8221 1.7262 1.3009 1.2027 1.2107 1.0626 1.0922 1.0747 1.0552 1.0508 1.0470 1.2001 1.0572 1.0900 2.1058 8.8344 6.7717 1.1005 1.0815 1.0330 1.0664 1.0350 1.0379 1.0278 1.1040 1.0941 1.0966 1.0970 1.1000 1.0996 1.1043 1.1052 1.1043 1.0896 1.0920 1.0446 1.0980
irintensity: 1.1493 0.6754 1.0362 0.6328 4.8981 2.7768 6.2932 0.0849 0.1183 1.3976 1.7710 1.2796 5.8471 3.1088 16.5734 16.2709 2.1759 8.3148 17.1245 1.1078 3.6383 0.5947 5.9410 3.0231 18.9011 7.3387 16.9727 201.6977 8.1872 1.5899 0.3134 2.4318 4.7177 6.8862 8.4969 7.1167 13.3976 0.5146 22.0681 13.5905 4.2905 8.2031 71.9501 22.1056 4.7033 20.1194 6.2783 8.3112 0.5949 7.5180 105.0957 2.7554 43.1719 51.5013 14.4770 2.0312 24.5020 165.8073 41.1542 6.2120 31.3129 17.4390 11.2892 8.4397 30.9262 8.8260 4.5356 19.1785 1.3206 17.9319 8.3073 14.0272 11.9710 120.5698 8.5272 46.7281 86.9858 25.1050 15.2728 49.7310 95.7749 56.4146 48.6849 94.5677 26.9542 36.1419 43.6079 10.6548 40.2036 38.6974 25.6157 23.9745 13.7502 24.9353 14.0044 12.0727 1.2069 1.4845 0.0284
temp: 298.150 k
press: 1.00000 atm
elementType: 16 8 8 7 6 6 6 6 6 6 6 6 6 6 6 6 1 1 1 1 1 1 1 1 1 1 1 1 1 1 1 1 1 1 1
symmnumber: 1
zpe: 757424.1 jmol-1
zpe.correction: 0.288488 hartree
zpe.thermalcorrener: 0.307880 hartree
zpe.thermalcorrenthalpy: 0.308824 hartree
zpe.thermalcorrgfe: 0.240068 hartree
zpe.sumelectzpe: -1070.640834 hartree
zpe.sumelectthermal: -1070.621442 hartree
zpe.sumelectthermalent: -1070.620498 hartree
zpe.sumelectthermalfe: -1070.689254 hartree
dipole: -1.1000 -3.6929 -3.2476
dipole: 5.0393
quadrupole: -101.8642 -88.7677 -105.2664
quadrupole: -0.9119 4.0338 -2.4899
quadrupole: -3.2314 9.8651 -6.6337 -0.9119 4.0338 -2.4899
hfenergy: -1070.929322 hartree
pointgroup: C01 [X(C12H19N1O2S1)]
dipole: 0.0855678 -1.363998 1.436288 debye
polarizability: 205.4438226|-17.6487704|182.2645065|-6.8421895|-9.7318359|118.2420602 unknown
InChI: InChI=1S/C12H19NO2S/c1-8(13)5-9-6-10(14-2)11(15-3)7-12(9)16-4/h6-8H,5,13H2,1-4H3
charge 0 multiplicity 1
35 atoms
S  -1.195448 2.840463 -0.675762
O  2.361693 -1.999355 0.324735
O  3.348342 0.361395 -0.932815
N  -4.360084 -1.054399 0.447258
C  -2.192869 0.071998 0.736226
C  -3.013413 -0.919022 -0.146616
C  -0.733309 0.187207 0.32877
C  -0.179503 1.341157 -0.289779
C  0.128958 -0.920926 0.549535
C  -3.151395 -0.420389 -1.597754
C  1.48778 -0.909145 0.165547
C  1.185688 1.365944 -0.661634
C  2.033668 0.262313 -0.444716
C  -1.110987 3.717392 1.000652
C  1.805075 -3.242003 0.864567
C  4.45202 0.038591 -0.004653
H  -2.256215 -0.279552 1.787496
H  -2.696935 1.051776 0.680786
H  -2.454496 -1.889323 -0.170392
H  -0.291213 -1.811054 1.029754
H  -2.160193 -0.293192 -2.065658
H  -3.674071 0.551929 -1.613768
H  -3.727897 -1.141642 -2.209063
H  1.613121 2.251183 -1.140912
H  -4.372852 -1.422403 1.403845
H  -5.045707 -1.514576 -0.15908
H  -0.062426 3.933017 1.25622
H  -1.575159 3.091258 1.778658
H  -1.674928 4.657181 0.888489
H  1.441329 -3.105622 1.901654
H  2.640231 -3.957833 0.856241
H  0.982217 -3.620221 0.227973
H  4.416101 0.700986 0.88241
H  5.369603 0.235888 -0.579715
H  4.409273 -1.016723 0.310302
