program: Gaussian 09
title: 000144878
version: EM64L-G09RevD.01
frameworkgroup: C1[X(C4H4O)]
method: RPBEPBE
basis: SDD
operation: Freq
keyword: #p
keyword: freq=noraman
keyword: PBEPBE/SDD
title: #p freq=noraman PBEPBE/SDD
converged: NO YES NO NO
title: Mulliken charges:
elementType: O C C C C H H H H
charge: -0.152097 -0.691026 -0.146501 -0.116696 0.140329 0.236535 0.236529 0.255518 0.237410
chargesum: 0.00000
title: Mulliken charges with hydrogens summed into heavy atoms:
elementType: O C C C C
charge: -0.152097 0.037555 0.090909 -0.116696 0.140329
polarizability: 9.48230347e+01 5.31838818e+00 3.07758222e+01 1.49301368e-03 5.97069832e-04 2.34393854e+01
1716.lowfreq: -7.3632 -6.5312 -0.0003 -0.0002 0.0004 32.4614 76.5681 129.1873 196.5899
frequency: 76.5629 129.1812 196.5897 405.0858 438.4230 576.0794 775.9926 777.4328 1034.1670 1043.6386 1114.6966 1312.9297 1377.2442 1449.5940 1452.2715 1695.4759 2199.2131 2966.5685 3013.2132 3036.6427 3124.8625
redmass: 5.1289 1.3644 3.2505 5.4794 5.3034 6.3446 1.3020 2.8993 1.6202 1.9221 2.7886 1.3257 1.2115 1.0740 1.0482 9.3608 11.9522 1.0389 1.0876 1.0947 1.0989
irintensity: 6.0301 1.0795 0.5399 21.8791 3.3010 25.3777 12.6936 5.0425 0.3066 33.4308 24.4035 46.0997 36.0083 17.6689 19.2274 2.4417 900.0434 4.8419 30.5246 13.3968 15.6527
temp: 298.150 k
press: 1.00000 atm
elementType: 8 6 6 6 6 1 1 1 1
symmnumber: 1
zpe: 168648.7 jmol-1
zpe.correction: 0.064235 hartree
zpe.thermalcorrener: 0.070137 hartree
zpe.thermalcorrenthalpy: 0.071081 hartree
zpe.thermalcorrgfe: 0.035142 hartree
zpe.sumelectzpe: -229.608001 hartree
zpe.sumelectthermal: -229.602099 hartree
zpe.sumelectthermalent: -229.601155 hartree
zpe.sumelectthermalfe: -229.637094 hartree
dipole: 4.0202 0.8582 0.0001
dipole: 4.1108
quadrupole: -31.2965 -28.3752 -28.9227
quadrupole: 0.1018 0.0003 -0.0002
quadrupole: -1.7651 1.1563 0.6088 0.1018 0.0003 -0.0002
hfenergy: -229.672236 hartree
pointgroup: C01 [X(C4H4O1)]
dipole: -1.598815 0.2439173 0.0001275 debye
dipolederiv: -1.6956543 -0.0440445 0.0001158 0.1617949 -0.1747709 0.0000021 0.0001572 0.0000225 -0.2641686 -0.4723752 -0.1405829 -0.0000325 -0.0817397 -0.0312751 -0.0000361 -0.0001574 -0.000031 0.01753 1.1174151 0.0178962 -0.0000354 0.1649514 0.4533447 0.0001423 -0.0000305 0.0001385 -0.0561806 -1.5817495 -0.0081761 0.0000673 -0.0744044 -0.4102462 -0.0000359 0.0000677 -0.0000399 -0.220472 2.4938657 0.0198999 -0.0001738 -0.1071698 0.2091819 0.0000016 -0.0002183 -0.0000126 0.2836064 0.0439217 0.013307 -0.1030909 -0.0615115 0.0857352 0.0552138 -0.1273004 0.0386597 -0.0160318 0.0438693 0.0133061 0.1031135 -0.0615139 0.085709 -0.0552121 0.127386 -0.0386404 -0.0159881 0.0841416 0.0785602 -0.0000003 -0.0002774 -0.0869399 0.0000013 0.0000465 0.000009 0.1221545 -0.0334345 0.049834 0.0000363 0.0598704 -0.1307386 -0.000077 0.0000491 -0.0001058 0.1495501 unknown
polarizability: 95.2261814|-1.5173306|30.3726751|-0.0038909|0.0012856|23.4393858 unknown
InChI: InChI=1S/C4H4O/c1-2-3-4-5/h2H,1H3
charge 0 multiplicity 1
9 atoms
O  2.570206 -0.02606 -0.000233
C  -2.427126 -0.514958 0.000021
C  -1.237518 0.411116 0.000124
C  0.054569 0.017514 0.000038
C  1.351301 0.068092 -0.000105
H  -3.063721 -0.317119 -0.885901
H  -3.063961 -0.317115 0.88576
H  -2.122651 -1.571922 0.000029
H  -1.4799 1.491051 0.000467
