program: Gaussian 09
title: 000144875
version: EM64L-G09RevD.01
frameworkgroup: C1[X(C23H30O)]
method: RPBEPBE
basis: SDD
operation: Freq
keyword: #pfreq=noraman
keyword: PBEPBE/SDD
title: #p freq=noraman PBEPBE/SDD
converged: YES YES NO NO
title: Mulliken charges:
elementType: O C C C C C C C C C C C C C C C C C C C C C C C H H H H H H H H H H H H H H H H H H H H H H H H H H H H H H
charge: -0.205919 0.452144 0.433034 -0.106743 -0.222208 -0.224521 0.608891 -0.269968 -0.719657 -0.644099 -0.086856 -0.717396 -0.706631 -0.705214 -0.720243 -0.696235 -0.697698 0.210708 0.307883 -0.323811 -0.409599 -0.794805 -0.267580 -0.229863 0.217812 0.216110 0.211376 0.240317 0.234608 0.222924 0.217141 0.206453 0.211458 0.210101 0.250703 0.209770 0.209230 0.255649 0.222859 0.218270 0.204396 0.228381 0.211340 0.212275 0.213068 0.212286 0.225078 0.264473 0.235503 0.250618 0.251495 0.207391 0.233386 0.231918
chargesum: 0.00000
title: Mulliken charges with hydrogens summed into heavy atoms:
elementType: O C C C C C C C C C C C C C C C C C C C C C C C
charge: -0.205919 0.452144 0.433034 -0.106743 -0.004396 -0.008412 0.608891 -0.058592 -0.479340 -0.409492 -0.086856 -0.070878 -0.034368 -0.030565 -0.074718 -0.044239 -0.047266 0.210708 0.307883 -0.059338 -0.174097 -0.085301 -0.034195 0.002055
polarizability: 3.12177921e+02 -1.25090580e+00 2.24715909e+02 -2.95801042e-01 3.09392011e-01 2.27887379e+02
1716.lowfreq: -23.3079 -4.4683 -0.0005 0.0006 0.0006 4.8235 6.0205 18.4062 23.7689
frequency: -22.5874 18.3701 23.6188 28.0033 37.3342 39.9998 76.8074 105.9570 109.3388 125.0075 130.8365 136.4103 138.2963 199.5715 203.2673 212.6735 214.9948 219.3410 229.5470 231.6017 241.4167 245.7928 253.8089 257.5397 287.2511 297.4567 312.7790 330.1405 350.3176 359.2965 392.0730 406.9007 427.6704 428.5010 467.1388 477.1735 510.2345 529.5908 554.3101 570.9056 599.0591 604.5315 629.2969 655.3616 680.0069 701.1034 743.0711 766.0063 794.5600 805.0086 819.5768 835.2181 881.2730 883.2509 903.5637 906.9949 907.4123 917.9250 920.1732 920.8869 941.1673 947.9573 954.2437 957.2147 961.2578 967.5147 993.4407 1000.6151 1042.4139 1049.7609 1052.8612 1073.2942 1086.0135 1107.3525 1112.7097 1113.9371 1116.7884 1132.2431 1157.8586 1161.6030 1176.8433 1177.4347 1196.7741 1209.5797 1247.9687 1249.6270 1279.4012 1285.4108 1291.9295 1293.3765 1309.0947 1312.5329 1323.4209 1342.6054 1371.7639 1374.8200 1376.8074 1377.5058 1382.3776 1395.1296 1395.9491 1397.2661 1404.1931 1423.9721 1431.3558 1450.4566 1455.7787 1463.9107 1465.2816 1466.3592 1466.7276 1467.9762 1468.3675 1469.1285 1470.7806 1478.7732 1482.5179 1484.5933 1487.7138 1488.2048 1490.4103 1536.1559 1571.5899 1579.3576 1607.9727 1612.5418 2971.6725 2972.4867 2972.8820 2975.9846 2976.9640 2977.2064 2977.6006 2980.9372 2985.4610 2987.7095 3065.0885 3065.3846 3065.6561 3071.9441 3072.4536 3072.9729 3074.4931 3075.4826 3075.7012 3076.4140 3080.7745 3083.0591 3085.2191 3086.4729 3119.3279 3121.5511 3126.4070 3134.8832 3146.3376 3164.1851
redmass: 2.7576 4.5233 3.4027 3.3564 2.8258 3.0229 3.1310 4.7543 4.7842 3.0405 3.3064 3.3949 3.1335 2.2911 2.2518 1.3005 1.2891 1.1529 1.8695 1.3070 1.1078 1.0848 1.0960 2.2576 3.2520 3.1108 3.4756 2.9836 2.7083 3.6662 5.6534 3.1055 2.9005 2.7256 2.8881 3.3715 3.8019 4.7473 3.6569 3.9426 3.1281 3.8252 3.9450 3.5343 5.0094 4.1065 1.5709 3.9379 2.4798 4.2650 3.4711 3.3886 2.5601 1.3131 1.7563 2.2514 1.8596 1.2028 1.2160 1.2254 2.6563 2.0556 1.4507 1.4717 1.5192 1.4254 1.6077 1.3425 1.5946 2.1632 1.6538 1.5993 2.2876 1.8312 2.5767 2.5829 2.5098 1.7783 2.0462 1.9548 1.9862 1.0762 1.7487 2.5976 2.7449 1.5432 1.5054 2.1352 1.4562 1.4052 1.3271 2.2847 1.7181 2.1179 5.3563 1.2268 1.1951 1.2067 2.1485 1.2043 1.2215 1.2370 1.2891 1.8439 2.5938 1.0466 2.2361 1.4070 1.1243 1.0526 1.1511 1.1947 1.0740 1.0544 1.4510 1.0485 1.0503 1.0494 1.0979 1.0741 1.0641 7.4095 7.5579 6.9217 6.0540 5.8505 1.0349 1.0356 1.0348 1.0401 1.0364 1.0401 1.0725 1.0823 1.0828 1.0367 1.1001 1.0999 1.0999 1.0989 1.0991 1.0988 1.0953 1.1004 1.1003 1.1003 1.0996 1.1001 1.1003 1.1013 1.0898 1.0865 1.0896 1.0884 1.0938 1.1006
irintensity: 0.2711 1.0205 0.0789 0.0323 0.0169 0.2646 1.0100 1.0861 1.2030 0.3110 0.1132 0.0099 0.3277 0.4650 0.3112 1.8550 0.2689 0.0121 0.7558 0.1816 0.0921 0.1223 0.1149 0.0134 2.2112 0.9598 3.6481 1.5665 0.0868 1.1164 1.1027 0.9211 0.5811 0.3763 0.4742 3.5438 1.3912 0.4249 1.4290 0.4531 9.2567 16.7263 0.4216 7.9244 2.5904 6.4238 64.6239 12.2416 8.1153 4.1023 1.3487 0.9695 4.6431 0.0381 11.4781 31.0383 22.3953 0.4378 4.2933 3.6362 34.1676 14.6312 0.0150 1.9255 5.7559 2.0301 3.3253 0.0217 8.3284 5.1591 12.5086 10.6116 3.7951 28.0941 4.5814 0.0624 2.4877 1.5525 0.7469 8.0048 12.1568 5.2459 5.9777 13.3406 160.9126 26.4798 5.7706 39.6845 1.9278 2.9690 0.8392 0.8716 6.8682 1.5980 24.4018 11.3749 7.6737 33.7588 1.5082 19.8942 5.2697 15.0443 22.1567 0.9725 10.5744 11.5419 13.6845 8.3228 5.2566 2.6845 6.6113 15.3571 4.1947 0.5348 38.9858 14.2192 7.9134 9.0217 16.8559 13.5582 9.2774 117.4433 21.6976 28.1989 19.9499 39.8629 27.9683 24.9135 36.5157 35.8848 47.3776 21.7741 24.6470 25.9174 28.9314 20.9108 4.6049 0.5041 3.4986 118.0723 126.2623 39.5972 8.5715 8.8360 36.9102 36.1417 35.4340 34.1984 29.0192 32.3215 22.1848 7.5345 18.7193 7.8692 23.4714 26.4306
temp: 298.150 k
press: 1.00000 atm
elementType: 8 6 6 6 6 6 6 6 6 6 6 6 6 6 6 6 6 6 6 6 6 6 6 6 1 1 1 1 1 1 1 1 1 1 1 1 1 1 1 1 1 1 1 1 1 1 1 1 1 1 1 1 1 1
symmnumber: 1
zpe: 1214928.9 jmol-1
zpe.correction: 0.462742 hartree
zpe.thermalcorrener: 0.488160 hartree
zpe.thermalcorrenthalpy: 0.489104 hartree
zpe.thermalcorrgfe: 0.406678 hartree
zpe.sumelectzpe: -967.895517 hartree
zpe.sumelectthermal: -967.870099 hartree
zpe.sumelectthermalent: -967.869155 hartree
zpe.sumelectthermalfe: -967.951581 hartree
dipole: 0.2885 0.0428 2.6422
dipole: 2.6583
quadrupole: -130.2407 -142.4783 -148.9875
quadrupole: -0.9667 3.3254 -0.0128
quadrupole: 10.3281 -1.9095 -8.4187 -0.9667 3.3254 -0.0128
hfenergy: -968.3582591 hartree
pointgroup: C01 [X(C23H30O1)]
dipole: 0.178664 -0.0070946 1.0304478 debye
polarizability: 311.8191987|0.5204037|224.6876102|-5.607899|0.1901831|228.2744003 unknown
InChI: InChI=1S/C23H30O/c1-14(2)18-12-20(15(3)4)22(21(13-18)16(5)6)23(24)19-11-9-8-10-17(19)7/h8-16H,1-7H3
charge 0 multiplicity 1
54 atoms
O  1.34888 0.004178 -2.194204
C  -0.83897 1.336002 -0.138958
C  -0.994869 -1.136978 -0.228092
C  -0.245766 0.066492 -0.390519
C  -0.058816 2.634025 -0.387189
C  -0.3741 -2.496807 -0.577609
C  -2.953785 0.203041 0.467532
C  -4.410695 0.284405 0.932515
C  -2.188669 1.377805 0.28874
C  -2.33825 -1.0444 0.201978
C  1.175573 -0.002941 -0.93359
C  -0.235808 3.6802 0.740814
C  -0.446999 3.229744 -1.769771
C  -0.756883 -2.896064 -2.030905
C  -0.743474 -3.620638 0.421465
C  -5.384502 -0.295407 -0.128094
C  -4.614079 -0.412861 2.304593
C  2.319047 -0.076906 0.034476
C  3.69202 -0.121904 -0.395384
C  2.020857 -0.1042 1.428462
C  4.69705 -0.189663 0.603282
C  4.118691 -0.099879 -1.849961
C  3.037319 -0.173362 2.398848
C  4.38694 -0.215601 1.980916
H  1.019647 2.384062 -0.433117
H  0.728553 -2.387104 -0.550377
H  -4.659692 1.357197 1.063103
H  -2.659269 2.348831 0.486174
H  -2.918309 -1.965601 0.331503
H  0.029665 3.257954 1.727155
H  0.414465 4.554683 0.553577
H  -1.276402 4.049649 0.796648
H  -1.521399 3.491822 -1.793738
H  0.13547 4.147284 -1.976368
H  -0.253215 2.502801 -2.578231
H  -1.853042 -3.010165 -2.126207
H  -0.284975 -3.857981 -2.306124
H  -0.427035 -2.12514 -2.749157
H  -0.495915 -3.336243 1.460437
H  -0.187897 -4.544198 0.174693
H  -1.821027 -3.866142 0.381477
H  -5.270915 0.220227 -1.098609
H  -6.433476 -0.184193 0.204681
H  -5.195568 -1.372428 -0.294059
H  -4.392708 -1.49439 2.236728
H  -5.660562 -0.30294 2.645588
H  -3.950702 0.019913 3.075092
H  0.971684 -0.070724 1.740107
H  5.746552 -0.22283 0.287354
H  3.746597 0.800463 -2.369381
H  3.69071 -0.949041 -2.41095
H  5.219815 -0.133387 -1.926804
H  2.78425 -0.193684 3.464151
H  5.193685 -0.268473 2.720908
