program: Gaussian 09
title: 000144868
version: EM64L-G09RevD.01
frameworkgroup: C1[X(C8H16O)]
method: RPBEPBE
basis: SDD
operation: Freq
keyword: #pfreq=noraman
keyword: PBEPBE/SDD
title: #p freq=noraman PBEPBE/SDD
converged: YES YES NO NO
title: Mulliken charges:
elementType: O C C C C C C C C H H H H H H H H H H H H H H H H
charge: -0.441680 -0.054437 -0.059979 -0.448027 -0.725070 -0.707823 -0.438365 -0.036686 -0.599533 0.206673 0.185646 0.191758 0.233130 0.222822 0.209912 0.216995 0.208627 0.243689 0.203828 0.201995 0.227118 0.318081 0.210245 0.213382 0.217698
chargesum: 0.00000
title: Mulliken charges with hydrogens summed into heavy atoms:
elementType: O C C C C C C C C
charge: -0.123599 0.131209 0.146694 -0.023138 -0.075341 -0.051679 -0.009252 0.173559 -0.168453
polarizability: 1.14899843e+02 -7.84321116e+00 8.00667705e+01 -3.77065077e+00 3.51442906e+00 7.82250439e+01
1716.lowfreq: -13.2535 -3.4086 -0.0008 -0.0004 0.0003 7.8108 47.7357 56.0823 83.9693
frequency: 47.6833 56.0430 83.9291 102.9706 142.1885 197.3290 216.1049 259.2667 277.4316 308.3870 334.3337 357.4840 392.1915 447.0280 473.8366 526.3580 638.1232 762.1162 824.0407 874.7273 918.0806 923.1619 934.0180 940.3336 954.6987 994.1359 1009.9031 1028.9167 1050.1859 1092.0822 1111.8579 1138.1266 1173.8942 1195.8935 1232.9854 1241.4252 1281.5387 1284.6541 1300.4122 1311.9210 1336.9115 1346.3220 1358.4023 1375.9618 1393.5738 1425.7963 1454.1805 1465.8299 1469.4940 1471.8888 1483.7379 1492.2224 1657.6318 2931.8288 2950.9510 2972.9483 2973.5786 2975.9695 3014.0272 3024.9695 3049.7362 3062.7046 3067.3620 3069.2840 3079.2308 3089.1787 3093.5313 3193.0805 3531.6364
redmass: 2.3689 2.7467 2.8450 2.4233 2.6406 1.1866 1.2249 2.1345 2.3540 1.1495 2.6184 2.1027 2.4431 2.2826 3.0427 2.2392 1.5769 1.5032 1.9320 2.7304 1.1864 1.8470 1.4821 1.4667 1.3951 1.3079 1.5750 3.6542 1.8670 1.5518 1.8092 2.2651 1.7400 1.6995 1.3872 1.4013 1.1727 1.2632 1.3422 1.3640 1.3691 1.5677 1.1850 1.2071 1.2067 1.1823 1.0859 1.0501 1.0626 1.0874 1.0495 1.0519 4.7558 1.0822 1.0660 1.0370 1.0589 1.0370 1.0846 1.0962 1.0969 1.0990 1.0838 1.0970 1.0991 1.0717 1.0989 1.1144 1.0656
irintensity: 0.0552 0.3224 0.6440 1.0229 0.6407 0.2186 0.2274 3.7344 5.6460 117.1257 36.6445 6.2090 0.1765 1.8357 11.2916 6.3682 23.2522 1.3653 20.0987 13.7612 2.4931 3.8104 6.7574 99.0789 1.2874 2.8135 49.7106 20.2181 29.1954 11.9687 1.8259 3.3738 5.6716 6.0730 17.8007 3.2229 2.4190 1.1520 0.1563 1.9955 3.3135 0.5131 29.7795 20.1526 20.1830 3.8445 1.7766 8.6042 8.2782 10.6502 5.3086 25.2464 23.4642 23.5783 23.1604 22.6687 25.4636 34.1066 25.4967 0.8983 38.5524 3.0682 32.8634 115.4629 40.3945 6.5805 22.4136 32.7579 4.3196
temp: 298.150 k
press: 1.00000 atm
elementType: 8 6 6 6 6 6 6 6 6 1 1 1 1 1 1 1 1 1 1 1 1 1 1 1 1
symmnumber: 1
zpe: 581694.8 jmol-1
zpe.correction: 0.221556 hartree
zpe.thermalcorrener: 0.233403 hartree
zpe.thermalcorrenthalpy: 0.234347 hartree
zpe.thermalcorrgfe: 0.183665 hartree
zpe.sumelectzpe: -388.890356 hartree
zpe.sumelectthermal: -388.878509 hartree
zpe.sumelectthermalent: -388.877564 hartree
zpe.sumelectthermalfe: -388.928247 hartree
dipole: 0.5280 1.2839 -1.3253
dipole: 1.9193
quadrupole: -60.0599 -62.7482 -53.7276
quadrupole: 0.7844 -0.8720 3.8750
quadrupole: -1.2146 -3.9030 5.1176 0.7844 -0.8720 3.8750
hfenergy: -389.1119115 hartree
pointgroup: C01 [X(C8H16O1)]
dipole: -0.2007855 0.5370033 0.4914067 debye
dipolederiv: -0.7904005 0.019532 0.0070977 -0.0146291 -0.7941658 0.1325512 0.0108297 0.1397904 -0.115443 -0.0057676 0.0514776 0.0049836 -0.0450486 0.02249 0.0123829 -0.0108697 -0.0302464 0.1698176 0.4531703 -0.0225906 0.0043675 0.0713271 0.577074 -0.1241849 0.0465288 -0.0996913 0.2578032 -0.1537639 -0.0608576 -0.0196847 -0.0656213 -0.0072521 -0.0122577 -0.1103528 -0.0825674 0.1530278 0.0088965 0.0214604 -0.0011144 -0.007564 -0.0834478 0.0240637 0.015432 -0.0031026 0.0829171 -0.0859524 -0.054111 -0.0431363 0.004211 -0.0317143 -0.0146985 -0.0078289 -0.0141796 0.0816768 -0.1620272 -0.0411124 -0.0167585 -0.1290023 0.0965281 -0.0255468 -0.022343 -0.0153386 0.0902923 0.2656029 0.1864214 0.017842 0.2819254 -0.1254411 -0.0479336 0.1641597 -0.014705 0.1549705 -0.2831081 0.1034354 0.0961176 0.0605996 -0.3821413 -0.0085649 0.1190014 -0.0005813 0.0698382 0.047597 0.0026139 -0.0086289 -0.0165196 0.0035471 0.006777 -0.0091146 0.0116539 -0.1494012 0.0248218 0.0087579 -0.0470451 0.0018373 0.0133574 0.0478669 -0.0163267 0.0316957 -0.2147332 0.0465484 -0.0029318 0.0227585 0.0024045 0.0637234 0.0228354 0.0095071 -0.0137537 -0.187118 0.0833753 -0.0250807 0.0074214 0.0239599 -0.1473236 0.036128 0.0027516 0.0551958 0.0537668 -0.0431392 -0.1380258 -0.0922551 -0.1229012 0.0024156 -0.034015 -0.0941263 -0.0498645 0.0277984 0.0958573 -0.0199133 0.0444852 -0.0079424 0.0610794 -0.0163758 0.0327281 0.0565328 -0.156803 -0.1387756 0.1462401 0.0521405 0.097387 0.0164675 -0.0093824 0.0539072 -0.0192668 0.0780208 -0.1591411 0.0620266 0.0648663 0.1068116 0.0510155 -0.0540995 0.0884864 -0.0495478 0.0386177 0.1385649 -0.0088832 -0.0044189 -0.0635146 -0.1265638 0.0277123 0.0038357 0.0430177 0.0825111 0.0670751 -0.0156647 0.0248394 -0.0009751 0.0837154 0.059723 -0.0491041 0.0251232 -0.1669671 0.022435 0.0031567 0.0087462 0.0095226 0.0758105 0.0397981 -0.0108917 -0.0039219 -0.1622049 0.0937555 -0.0366177 -0.0025309 0.0280873 -0.098197 0.0217653 -0.0462504 0.0406462 0.0818538 0.3928611 -0.0078387 -0.0065956 0.0045249 0.2811057 -0.1129143 -0.0099216 -0.0315266 -0.0232949 0.0577166 -0.0372086 0.0066655 -0.0556924 0.1243766 0.0273918 -0.0609036 0.0145327 -0.1576283 -0.0740054 -0.0966349 -0.0754035 -0.1234103 0.1579798 -0.0135109 -0.0910138 -0.0204473 0.0355185 0.0978034 -0.037651 -0.0447596 -0.0397773 0.1655609 0.0144887 -0.0081204 0.0305524 -0.1248371 unknown
polarizability: 114.9692096|7.305531|79.5231159|-4.4614356|-3.6061612|78.6993323 unknown
InChI: InChI=1S/C8H16O/c1-4-5-6-8(9)7(2)3/h4,7-9H,1,5-6H2,2-3H3
charge 0 multiplicity 1
25 atoms
O  -0.899937 -1.811629 0.204886
C  -2.107899 0.370646 0.315982
C  -0.834398 -0.376146 -0.173851
C  0.496119 0.237164 0.31589
C  -2.089739 1.873521 -0.058803
C  -3.379902 -0.308114 -0.246029
C  1.738238 -0.500356 -0.251365
C  3.032698 -0.006696 0.356324
C  4.077345 0.521829 -0.330363
H  -0.841909 -0.414675 -1.280555
H  -2.1279 0.291879 1.427123
H  0.518132 0.211667 1.42774
H  0.54915 1.302304 0.024214
H  -1.298264 2.433378 0.469633
H  -1.933661 2.003008 -1.147507
H  -3.058053 2.341635 0.196324
H  -4.290765 0.116204 0.214825
H  -3.361235 -1.395897 -0.06308
H  -3.449849 -0.150645 -1.340008
H  1.768077 -0.380323 -1.351959
H  1.611305 -1.583985 -0.05302
H  -0.903941 -1.862002 1.196366
H  3.108427 -0.093998 1.453005
H  4.989659 0.858073 0.175383
H  4.049301 0.62966 -1.422153
