program: Gaussian 09
title: 000144866
version: EM64L-G09RevD.01
frameworkgroup: C1[X(C6H8P2)]
method: RPBEPBE
basis: SDD
operation: Freq
keyword: #p
keyword: freq=noraman
keyword: PBEPBE/SDD
title: #p freq=noraman PBEPBE/SDD
converged: NO YES NO YES
title: Mulliken charges:
elementType: P P C C C C C C H H H H H H H H
charge: 0.114284 0.114284 -0.176890 -0.176886 -0.244534 -0.244537 -0.244494 -0.244494 0.236007 0.236006 0.236012 0.236013 0.039800 0.039816 0.039816 0.039800
chargesum: 0.00000
title: Mulliken charges with hydrogens summed into heavy atoms:
elementType: P P C C C C C C
charge: 0.193900 0.193899 -0.176890 -0.176886 -0.008528 -0.008531 -0.008482 -0.008482
polarizability: 1.71396268e+02 2.18935113e-05 1.03857179e+02 -2.79209070e-03 -7.59757031e-04 5.67624972e+01
1716.lowfreq: -104.5986 -98.3282 -8.4165 -0.9921 -0.0028 -0.0020 -0.0015 19.0312 88.5155
frequency: -104.5953 -98.3148 88.5155 170.3558 257.2580 283.2220 296.3027 386.9414 472.4533 475.2230 626.5242 693.7972 706.9049 765.2030 803.7795 811.0273 822.3961 838.6010 848.4365 948.4540 961.5023 997.9509 1067.4523 1071.3918 1082.3319 1111.0707 1121.2699 1206.0533 1301.4017 1339.0965 1391.3731 1471.2111 1557.4116 1591.7431 2189.3260 2190.5353 2214.7763 2214.9618 3113.0583 3114.2808 3134.2512 3139.9117
redmass: 1.1373 1.0560 6.8047 4.8741 5.0856 3.5329 13.6010 2.7627 2.5892 9.2089 7.0286 2.5706 6.1325 1.1697 1.1019 1.3256 1.0918 1.2544 1.5076 1.3365 1.3951 4.6479 2.3792 1.0818 1.4811 1.9450 1.4453 1.1171 1.2577 4.2247 3.4862 2.1010 6.6128 6.0758 1.0331 1.0332 1.0420 1.0420 1.0869 1.0872 1.0963 1.0977
irintensity: 13.8402 0.0000 0.2100 0.0001 3.8785 0.0000 0.0107 0.0000 20.7537 1.2983 0.0000 0.1928 4.4487 84.3829 25.4902 4.4402 0.0000 0.0277 1.1974 0.2083 0.0000 23.8551 1.1065 55.9429 9.6568 0.3948 3.1771 0.2893 0.0000 11.8932 7.7909 31.9846 0.0000 0.1563 91.7878 114.4299 0.0205 124.3481 0.0003 11.9087 34.9367 0.0025
temp: 298.150 k
press: 1.00000 atm
elementType: 15 15 6 6 6 6 6 6 1 1 1 1 1 1 1 1
symmnumber: 1
zpe: 292353.9 jmol-1
zpe.correction: 0.111352 hartree
zpe.thermalcorrener: 0.118835 hartree
zpe.thermalcorrenthalpy: 0.119779 hartree
zpe.thermalcorrgfe: 0.078654 hartree
zpe.sumelectzpe: -915.270688 hartree
zpe.sumelectthermal: -915.263205 hartree
zpe.sumelectthermalent: -915.262261 hartree
zpe.sumelectthermalfe: -915.303386 hartree
dipole: 0.0000 0.0010 2.0167
dipole: 2.0167
quadrupole: -64.8148 -55.9642 -69.3163
quadrupole: 0.0002 -0.0001 -0.0012
quadrupole: -1.4497 7.4009 -5.9512 0.0002 -0.0001 -0.0012
hfenergy: -915.3820398 hartree
pointgroup: C01 [X(C6H8P2)]
dipole: -0.0000142 -0.0003899 0.7934188 debye
dipolederiv: 0.1595409 0.0000122 -0.0089753 -0.0001167 0.2647514 -0.0000698 0.1350741 -0.0000633 0.4727704 0.1595492 -0.0000176 0.0089625 0.0001205 0.2647512 -0.000075 -0.1350821 -0.0000743 0.472763 0.433908 0.0000328 -0.0335719 -0.0000723 -0.1398398 0.0000199 0.2323978 0.000045 -0.2173001 0.4339168 -0.0000111 0.0336005 0.0001026 -0.1398393 0.0000214 -0.2323756 0.0000381 -0.2173066 -0.2226132 -0.0912396 0.0110756 -0.0130603 0.0769324 0.0048291 0.0099853 -0.0000131 -0.1004665 -0.2226174 0.0912275 -0.0110823 0.0130482 0.0769364 0.0048285 -0.0099855 -0.0000131 -0.1004685 -0.2225681 0.0912305 0.0110529 0.0130846 0.0769746 -0.0048831 0.0100195 -0.0000864 -0.1004706 -0.2225628 -0.0912432 -0.0110565 -0.0130982 0.07697 -0.0048834 -0.0100266 -0.000089 -0.1004721 0.0116701 0.0996826 0.0036313 0.0787889 -0.0454744 0.0028267 0.0065463 0.0061757 0.1377651 0.0116776 -0.0996808 -0.0036367 -0.0787866 -0.045482 0.002823 -0.0065539 0.0061727 0.1377644 0.011715 -0.0996854 0.0036698 -0.078786 -0.0454842 -0.0027894 0.0065565 -0.0061009 0.1377712 0.0117089 0.0996879 -0.003676 0.0787886 -0.0454762 -0.0027859 -0.0065625 -0.0060963 0.137771 -0.0857713 -0.0514801 0.0277978 0.0458578 -0.0940843 0.0873439 -0.16582 0.1761778 -0.1648765 -0.0858836 0.0514299 0.0278303 -0.045665 -0.0937754 -0.0872762 -0.1659473 -0.1761343 -0.1651903 -0.0858942 -0.05142 -0.0278248 0.045662 -0.0937648 -0.0872728 0.1659623 -0.176128 -0.1651951 -0.0857757 0.0514744 -0.0277971 -0.0458681 -0.0940955 0.087343 0.1658117 0.1761893 -0.1648588 unknown
polarizability: 171.3962677|0.0014374|103.8571787|0.0027921|0.0007598|56.7624972 unknown
InChI: InChI=1S/C6H8P2/c7-5-1-2-6(8)4-3-5/h1-4H,7-8H2
charge 0 multiplicity 1
16 atoms
P  3.31797 0.000229 -0.089704
P  -3.318042 0.000095 -0.089866
C  1.43381 0.000116 0.041106
C  -1.433888 0.000055 0.041028
C  0.706203 -1.216853 0.032312
C  -0.706231 -1.216883 0.032277
C  0.706148 1.217056 0.032098
C  -0.706279 1.217025 0.032062
H  1.235513 -2.177591 0.033561
H  -1.235501 -2.177645 0.033505
H  1.235413 2.177822 0.033135
H  -1.235584 2.177768 0.033076
H  3.560434 -1.064464 0.875366
H  3.560403 1.063849 0.876561
H  -3.560563 1.063666 0.876433
H  -3.560505 -1.064647 0.875151
