program: Gaussian 09
title: 000144861
version: EM64L-G09RevD.01
frameworkgroup: C1[X(C16H26N2)]
method: RPBEPBE
basis: SDD
operation: Freq
keyword: #pfreq=noraman
keyword: PBEPBE/SDD
title: #p freq=noraman PBEPBE/SDD
converged: YES YES NO NO
title: Mulliken charges:
elementType: N N C C C C C C C C C C C C C C C C H H H H H H H H H H H H H H H H H H H H H H H H H H
charge: -0.096658 -0.096663 0.191573 0.191585 -0.091914 -0.091909 -0.474721 -0.492130 -0.490820 -0.474727 -0.492128 -0.490826 -0.446863 -0.433809 -0.435148 -0.446865 -0.433817 -0.435144 0.201469 0.201466 0.222914 0.222972 0.220199 0.227398 0.225505 0.222320 0.222927 0.222961 0.220190 0.227400 0.225503 0.222328 0.202284 0.203897 0.204021 0.206560 0.204898 0.206055 0.202281 0.203901 0.204018 0.206564 0.204894 0.206060
chargesum: 0.00000
title: Mulliken charges with hydrogens summed into heavy atoms:
elementType: N N C C C C C C C C C C C C C C C C
charge: -0.096658 -0.096663 0.191573 0.191585 0.109555 0.109557 -0.028835 -0.044533 -0.042995 -0.028839 -0.044538 -0.042994 -0.040683 -0.023229 -0.024195 -0.040684 -0.023234 -0.024190
polarizability: 2.32503331e+02 4.91507147e+00 1.53507580e+02 1.70700004e-04 -4.05379940e-05 1.50821283e+02
1716.lowfreq: -15.0418 -10.1692 -9.0075 -0.0006 -0.0003 0.0004 16.9844 24.9313 28.7550
frequency: 16.1999 24.4527 25.3469 57.1677 69.9471 73.9102 173.5066 211.5060 241.8789 254.4065 257.3729 286.2027 328.9626 341.3157 345.3722 374.7144 405.8344 489.9917 491.8535 493.3465 496.2075 498.3036 502.1888 525.9663 649.4278 691.1166 776.1492 776.4558 787.6437 787.9933 788.4443 809.6702 809.8587 815.5740 817.0846 877.3343 883.2916 909.3460 912.4186 912.6330 915.4184 917.4287 920.6318 969.3692 980.6907 989.7361 995.3369 1022.7460 1038.6156 1041.5843 1058.5145 1060.5603 1061.4191 1071.2515 1078.8475 1110.7881 1110.8598 1112.7303 1116.1375 1120.3582 1125.2352 1194.2973 1197.9788 1201.8336 1207.5829 1220.0849 1220.8124 1258.4262 1258.6060 1260.2273 1260.3735 1267.2157 1277.8306 1280.7876 1286.1325 1299.5095 1300.6623 1308.2927 1308.5456 1311.5748 1315.9091 1324.9641 1325.2608 1339.1193 1340.5202 1340.5969 1341.7037 1456.8743 1458.9365 1462.7102 1462.8624 1462.8786 1471.6174 1472.0245 1474.6763 1475.1729 1475.6962 1476.0308 1497.0383 1497.2356 2975.2157 2975.5498 2977.4956 2977.5622 2978.2296 2978.4001 2995.8474 2996.0495 2996.3238 2996.5901 3003.0983 3003.4841 3015.4503 3016.1802 3024.1852 3024.3366 3029.5434 3029.5612 3030.8850 3030.9362 3054.2741 3054.5242 3063.9072 3064.0244 3064.6153 3065.0450
redmass: 2.6939 2.1341 1.7525 3.0897 4.4488 3.9775 3.6312 3.0804 1.8740 1.7100 1.7625 1.9853 2.7559 2.4254 2.3966 2.3537 3.0840 4.6558 4.5776 3.9781 3.7436 3.5948 3.7567 8.9668 6.3456 4.9249 1.1930 1.1911 5.1496 2.9272 2.9477 1.4140 1.3921 1.3845 1.4066 4.8166 5.5287 2.2007 1.4524 1.5443 2.3099 2.3330 2.4876 2.1865 2.1669 2.1505 2.5884 4.7078 2.5705 2.3055 2.2922 5.3096 2.2107 2.2037 2.1884 1.0329 1.0322 1.5821 1.5021 1.4129 1.3235 1.2673 1.2690 1.3644 1.3557 1.1277 1.1289 1.4421 1.3632 1.4291 1.3576 1.3081 1.5674 1.4416 1.5683 1.5712 1.6427 1.6121 1.6273 1.6784 1.8568 1.5122 1.5037 1.4610 1.4741 1.4778 1.4770 1.6127 1.0766 1.7810 1.2786 1.0794 1.0883 1.0890 1.0858 1.0846 1.0863 1.0823 1.0924 1.1101 1.0623 1.0625 1.0591 1.0591 1.0585 1.0586 1.0621 1.0644 1.0649 1.0615 1.0642 1.0644 1.0782 1.0785 1.1036 1.1035 1.1028 1.1028 1.1025 1.1025 1.1043 1.1044 1.1035 1.1034 1.1025 1.1025
irintensity: 0.0088 0.2077 0.0032 0.1930 0.1868 0.6369 0.0000 0.0001 0.0141 0.3212 1.3950 0.0057 0.0130 1.2640 0.7498 0.0005 0.0003 2.0855 2.2308 0.6269 0.0115 1.2079 5.0534 2.7282 0.0000 0.6438 0.0811 0.1619 0.0000 6.1801 0.0122 0.2253 5.4022 4.6191 0.2342 0.0018 9.8938 0.0522 0.0049 0.0326 10.4991 12.5905 0.0771 0.0176 2.2722 4.4596 0.0279 0.0053 0.1580 0.0000 0.0064 0.3907 0.0001 0.8229 0.0035 0.0117 0.0011 0.0157 1.3868 1.2092 0.0195 0.0458 0.6349 0.5042 0.0429 0.1054 0.0583 8.8190 3.0293 14.9481 9.0046 0.7541 5.6172 0.6470 0.0090 0.0156 0.2298 1.2823 0.0170 24.5122 0.0015 0.0001 1.1212 2.7600 0.2880 0.3022 1.3130 0.0037 1.1817 0.0535 0.2834 0.0275 25.9543 0.0070 20.0357 5.2163 7.4193 9.9095 2.1704 0.0159 76.5198 0.4592 0.1122 55.0669 1.6834 23.9625 20.9512 99.8672 3.9473 154.4981 0.0105 154.8041 155.1710 0.0129 4.6193 0.7374 30.1104 0.3122 14.4480 0.3118 0.4932 1.7982 0.1626 158.2821 2.0022 140.7151
temp: 298.150 k
press: 1.00000 atm
elementType: 7 7 6 6 6 6 6 6 6 6 6 6 6 6 6 6 6 6 1 1 1 1 1 1 1 1 1 1 1 1 1 1 1 1 1 1 1 1 1 1 1 1 1 1
symmnumber: 1
zpe: 1032512.3 jmol-1
zpe.correction: 0.393263 hartree
zpe.thermalcorrener: 0.409872 hartree
zpe.thermalcorrenthalpy: 0.410816 hartree
zpe.thermalcorrgfe: 0.346556 hartree
zpe.sumelectzpe: -733.353290 hartree
zpe.sumelectthermal: -733.336681 hartree
zpe.sumelectthermalent: -733.335736 hartree
zpe.sumelectthermalfe: -733.399997 hartree
dipole: 0.0000 0.0000 -0.0052
dipole: 0.0052
quadrupole: -102.5022 -111.5925 -108.3604
quadrupole: 0.6341 0.0002 0.0002
quadrupole: 4.9828 -4.1075 -0.8753 0.6341 0.0002 0.0002
hfenergy: -733.7465528 hartree
pointgroup: C01 [X(C16H26N2)]
dipole: 0.0000008 0.0000053 -0.0020562 debye
polarizability: 232.4673698|5.1959027|153.5435412|-0.0001708|0.0000399|150.8212831 unknown
InChI: InChI=1S/C16H26N2/c1-7-15(8-2-13(1)3-9-15)17-18-16-10-4-14(5-11-16)6-12-16/h13-14H,1-12H2
charge 0 multiplicity 1
44 atoms
N  -0.398425 -0.505764 0.008132
N  0.398385 0.505828 0.00823
C  -1.859177 -0.150605 0.004714
C  1.859144 0.150679 0.004793
C  -4.457129 0.147028 -0.005269
C  4.4571 -0.146937 -0.00529
C  -2.202049 1.357487 -0.002961
C  -2.472084 -0.820589 1.270336
C  -2.464571 -0.832919 -1.257696
C  2.202029 -1.357412 -0.002674
C  2.47212 0.820879 1.270257
C  2.464463 0.832785 -1.257773
C  -3.75996 1.533321 -0.042361
C  -4.022944 -0.606802 1.278854
C  -4.021703 -0.674387 -1.246935
C  3.759936 -1.533237 -0.042276
C  4.022961 0.606957 1.27881
C  4.021612 0.674408 -1.24698
H  -5.557105 0.2775 -0.009394
H  5.557077 -0.277402 -0.009456
H  -1.717938 1.838695 -0.871959
H  -1.762927 1.836241 0.891152
H  -2.004265 -0.379763 2.170522
H  -2.209072 -1.894223 1.263389
H  -2.165029 -1.89684 -1.261365
H  -2.022092 -0.369143 -2.159236
H  1.717792 -1.838781 -0.871508
H  1.763048 -1.83601 0.891594
H  2.004274 0.380302 2.170552
H  2.2092 1.894534 1.263079
H  2.164823 1.896677 -1.261677
H  2.022023 0.368757 -2.159203
H  -4.101703 2.14396 0.815415
H  -4.064859 2.075093 -0.958496
H  -4.548806 -1.578923 1.336297
H  -4.327537 -0.024228 2.169167
H  -4.364221 -0.165032 -2.167747
H  -4.514053 -1.665632 -1.227303
H  4.101795 -2.143867 0.81546
H  4.06472 -2.075014 -0.958447
H  4.548905 1.579033 1.336248
H  4.327489 0.02437 2.169138
H  4.364192 0.165074 -2.16778
H  4.513863 1.665702 -1.227353
