program: Gaussian 09
title: 000144855
version: EM64L-G09RevD.01
frameworkgroup: C1[X(C14H30N2Si2)]
method: RPBEPBE
basis: SDD
operation: Freq
keyword: #p
keyword: freq=noraman
keyword: PBEPBE/SDD
title: #p freq=noraman PBEPBE/SDD
converged: YES YES NO NO
title: Mulliken charges:
elementType: Si Si N N C C C C C C C C C C C C C C H H H H H H H H H H H H H H H H H H H H H H H H H H H H H H
charge: 1.365661 1.368663 -0.732411 -0.733105 0.280404 0.279800 0.281229 0.281747 -1.030854 -1.018802 -1.031134 -1.029874 -1.035179 -1.020025 -0.801572 -0.801645 -0.800338 -0.803912 0.232769 0.248404 0.233263 0.239422 0.239839 0.225172 0.233079 0.248198 0.232910 0.246975 0.232317 0.234437 0.231873 0.233846 0.250388 0.239837 0.225453 0.239829 0.220731 0.222734 0.234343 0.222933 0.220940 0.234275 0.222153 0.221191 0.234432 0.224774 0.233882 0.220949
chargesum: 0.00000
title: Mulliken charges with hydrogens summed into heavy atoms:
elementType: Si Si N N C C C C C C C C C C C C C C
charge: 1.365661 1.368663 -0.732411 -0.733105 0.280404 0.279800 0.281229 0.281747 -0.316419 -0.314370 -0.316947 -0.316146 -0.319071 -0.314906 -0.123764 -0.123497 -0.122561 -0.124306
polarizability: 2.62290760e+02 -1.11253126e-01 2.03629153e+02 -7.47906296e-02 -1.77622112e-02 1.83731706e+02
1716.lowfreq: -48.2516 -0.0017 -0.0016 0.0001 8.4660 11.5113 16.1341 29.8952 38.7675
frequency: -47.8803 29.3556 38.7007 52.5510 59.8702 67.9591 74.0937 82.3911 97.0290 109.8900 114.6128 117.9970 121.9862 126.5405 131.8199 143.7359 163.9170 169.0771 172.1403 173.4594 176.2830 182.7639 183.4613 223.4952 224.1654 230.9480 243.4002 245.7553 250.0968 300.0176 308.6820 337.0216 351.8317 384.3737 432.7762 462.4613 483.8034 497.6279 524.3258 587.9789 595.0578 605.8990 615.1629 686.3834 687.0950 690.5536 691.2300 710.0253 737.1897 738.8615 772.1715 805.0890 806.1862 810.4927 823.4815 856.0938 893.4950 897.6444 898.5197 904.5313 906.6411 931.5475 971.1555 983.2268 995.9724 1009.3404 1031.4051 1035.5472 1039.1021 1043.0264 1100.9374 1185.0937 1210.5645 1234.0626 1239.3183 1260.1329 1288.8196 1289.2550 1290.8231 1294.4270 1300.9495 1306.7178 1382.0615 1385.9059 1398.5395 1400.4450 1432.7613 1435.3651 1440.2220 1440.9444 1444.0168 1444.3786 1445.2967 1446.4267 1448.1872 1450.9140 1455.6448 1458.3382 1461.0658 1461.2344 1461.9569 1465.0734 1468.1010 1469.7505 1478.5592 1480.2967 1660.5808 1696.8477 2964.1910 2964.8544 2966.7478 2967.9041 2977.1914 2977.7236 2981.9604 2982.4900 2983.5459 2984.0669 3032.3982 3032.8177 3033.5942 3034.8736 3079.3662 3079.8951 3080.8993 3081.3727 3084.4588 3084.8801 3084.9514 3086.2977 3086.4082 3087.0587 3092.4009 3093.1561 3093.2201 3093.7969 3094.0488 3095.0518
redmass: 1.4490 2.4083 2.9668 1.6138 1.7397 1.8747 1.7197 1.5712 1.1335 1.0618 1.0344 1.1159 1.1126 1.1506 1.1249 2.5012 2.3216 2.0819 2.4865 2.4456 2.2703 2.3648 2.4152 2.6613 2.6221 2.5532 2.7801 2.9139 3.0533 3.4713 2.7927 2.8784 3.0871 4.2320 3.6598 5.5583 4.3635 3.6467 4.3933 4.5887 3.4981 4.0327 4.1510 2.9723 2.9700 2.9812 2.9739 3.1083 1.1679 1.1771 2.6858 1.3854 1.3919 1.3633 1.5194 3.2331 1.5212 1.5234 1.5251 1.5186 1.5022 1.7551 2.4551 1.5023 3.2386 1.4838 1.4251 1.4988 1.4800 1.5372 2.2205 3.7641 6.6652 8.4840 8.4548 5.1216 1.2077 1.2079 1.2068 1.2052 1.1970 1.1916 1.2456 1.2923 1.2218 1.2150 1.0560 1.0570 1.0523 1.0534 1.0537 1.0540 1.0509 1.0509 1.0525 1.0515 1.0469 1.0486 1.0500 1.0495 1.0629 1.0586 1.0477 1.0475 1.0735 1.0681 6.7227 7.5448 1.0381 1.0380 1.0385 1.0385 1.0342 1.0342 1.0346 1.0346 1.0345 1.0345 1.0966 1.0966 1.0964 1.0963 1.0980 1.0980 1.0981 1.0980 1.0974 1.0975 1.0973 1.0977 1.0976 1.0981 1.0973 1.0958 1.0973 1.0954 1.0969 1.0974
irintensity: 0.0418 0.0103 0.0331 1.2057 0.0386 2.1949 0.0171 0.0123 0.5697 0.0062 0.0037 0.4126 0.0469 2.2089 0.0483 2.0023 0.2314 0.0772 0.0074 1.7084 0.1591 0.0179 0.0086 0.5425 6.5203 2.3902 9.5676 0.6026 7.2607 8.8895 2.9241 0.8954 0.0708 31.4755 0.0037 5.6843 17.2813 0.0003 8.4112 4.4494 0.0032 7.0394 21.1703 19.6893 9.6619 2.4127 17.3562 6.1399 0.0172 0.1009 0.1926 25.7877 16.7897 0.1479 22.7428 4.4302 1.0437 106.2065 122.8064 90.6831 296.6427 130.9877 139.0983 19.4067 0.0076 10.9507 0.0043 0.0054 16.8250 5.6186 0.0011 158.7404 47.7978 259.0946 0.1002 40.2999 11.2355 44.6694 32.9609 80.9899 38.5514 46.3120 0.0077 1.7585 30.1756 15.8916 0.0378 0.3052 0.1626 0.1707 1.1933 1.1273 1.3980 2.5645 7.8690 23.2694 11.9143 0.5745 10.0113 3.3803 2.9138 9.6241 0.0666 9.1508 52.5652 1.6585 23.7525 0.1815 13.6671 134.7835 55.1289 26.5036 19.2275 16.9121 19.2735 11.0190 12.2204 15.7758 9.6689 10.1346 40.5396 49.3075 12.3035 13.1730 3.2365 2.5899 73.1698 21.2114 30.1483 26.6930 19.7864 5.3029 62.7521 49.7959 19.1182 12.0305 10.8718 13.8429
temp: 298.150 k
press: 1.00000 atm
elementType: 14 14 7 7 6 6 6 6 6 6 6 6 6 6 6 6 6 6 1 1 1 1 1 1 1 1 1 1 1 1 1 1 1 1 1 1 1 1 1 1 1 1 1 1 1 1 1 1
symmnumber: 1
zpe: 1065550.7 jmol-1
zpe.correction: 0.405847 hartree
zpe.thermalcorrener: 0.433113 hartree
zpe.thermalcorrenthalpy: 0.434057 hartree
zpe.thermalcorrgfe: 0.349157 hartree
zpe.sumelectzpe: -1238.365151 hartree
zpe.sumelectthermal: -1238.337885 hartree
zpe.sumelectthermalent: -1238.336941 hartree
zpe.sumelectthermalfe: -1238.421841 hartree
dipole: -0.0200 0.0014 0.4205
dipole: 0.4210
quadrupole: -125.1734 -125.7931 -128.1348
quadrupole: -0.0340 0.0145 0.0255
quadrupole: 1.1937 0.5740 -1.7677 -0.0340 0.0145 0.0255
hfenergy: -1238.7709977 hartree
pointgroup: C01 [X(C14H30N2Si2)]
dipole: -0.0049766 0.0010919 0.1655549 debye
polarizability: 262.2644286|-0.1225128|203.6288697|-1.4388893|-0.0797741|183.75832 unknown
InChI: InChI=1S/C14H30N2Si2/c1-11-12(2)16(18(8,9)10)14(4)13(3)15(11)17(5,6)7/h1-10H3
charge 0 multiplicity 1
48 atoms
Si 2.631746 0.000365 0.744746
Si -2.596521 0.001027 0.832441
N  1.339837 -0.00306 -0.534022
N  -1.341953 0.00078 -0.482468
C  0.67451 -1.218204 -0.969454
C  0.677804 1.212017 -0.974693
C  -0.697355 -1.21646 -0.942468
C  -0.694123 1.213844 -0.948407
C  2.420098 -1.556332 1.837166
C  4.381666 0.01059 -0.031706
C  2.398626 1.552179 1.839956
C  -2.300746 -1.522239 1.952129
C  -2.380765 1.584597 1.885617
C  -4.368793 -0.055091 0.110425
C  1.559573 -2.287845 -1.5761
C  1.565584 2.278763 -1.582248
C  -1.607788 -2.286656 -1.509591
C  -1.601977 2.280854 -1.525326
H  3.05927 -1.470546 2.736222
H  1.370424 -1.656472 2.167972
H  2.701605 -2.486883 1.313705
H  4.5374 -0.883738 -0.662535
H  4.524819 0.901936 -0.669554
H  5.163984 0.019145 0.750861
H  2.686855 2.485365 1.324712
H  1.342215 1.646976 2.150458
H  3.020679 1.465426 2.750764
H  -1.244177 -1.559409 2.274284
H  -2.935976 -1.454277 2.855448
H  -2.535333 -2.475793 1.447239
H  -2.775739 2.486536 1.385618
H  -2.919773 1.470243 2.845001
H  -1.3125 1.758711 2.108808
H  -4.523784 -0.969487 -0.490917
H  -5.126343 -0.042687 0.916988
H  -4.552267 0.81549 -0.545809
H  0.99442 -3.194865 -1.846679
H  2.360781 -2.596613 -0.877459
H  2.061008 -1.906572 -2.487349
H  2.362423 2.592056 -0.880441
H  1.001071 3.183864 -1.860442
H  2.072553 1.893451 -2.488685
H  -2.375122 -2.598639 -0.775071
H  -1.053552 -3.191925 -1.807136
H  -2.151819 -1.905474 -2.396072
H  -2.371762 2.596729 -0.79549
H  -2.142013 1.893701 -2.411703
H  -1.046965 3.184417 -1.826635
