program: Gaussian 09
title: 000144854
version: EM64L-G09RevD.01
frameworkgroup: C1[X(C8H18N2Si2)]
method: RPBEPBE
basis: SDD
operation: Freq
keyword: #p
keyword: freq=noraman
keyword: PBEPBE/SDD
title: #p freq=noraman PBEPBE/SDD
converged: YES YES NO NO
title: Mulliken charges:
elementType: Si Si N N C C C C C C C C H H H H H H H H H H H H H H H H H H
charge: 1.099395 1.099394 -0.595426 -0.595425 -0.118814 -0.148202 -0.118810 -0.148202 -1.007096 -1.008252 -1.007081 -1.008267 -0.101310 -0.101311 0.209576 0.223430 0.209574 0.223431 0.251044 0.234103 0.237876 0.237413 0.234725 0.251535 0.237886 0.251041 0.234094 0.251540 0.237400 0.234738
chargesum: 0.00000
title: Mulliken charges with hydrogens summed into heavy atoms:
elementType: Si Si N N C C C C C C C C
charge: 0.998085 0.998082 -0.595426 -0.595425 0.090763 0.075228 0.090764 0.075228 -0.284073 -0.284578 -0.284059 -0.284589
polarizability: 2.15106347e+02 8.98687447e-02 1.17000475e+02 6.60445353e-06 2.01554235e-03 1.25484948e+02
1716.lowfreq: -31.0598 -3.0105 -0.0022 -0.0020 -0.0012 8.0343 14.5156 17.6122 28.5038
frequency: -31.0328 14.1771 28.4338 70.6362 93.5962 110.8254 115.4280 118.6727 132.9480 139.5609 168.2255 171.8764 200.1403 216.7207 257.2349 266.7634 327.9771 336.5022 441.3778 496.6763 572.3855 625.3227 636.0774 640.7746 646.5586 665.4276 668.1929 684.3360 691.6979 693.6629 695.2059 755.0205 758.8323 809.2633 810.4888 835.9334 863.1695 896.2243 897.1924 902.4116 902.8920 907.3009 926.9159 977.4534 1062.9497 1072.3329 1075.6363 1098.7115 1240.0497 1297.1246 1297.2789 1303.0745 1305.4843 1308.7528 1332.1583 1410.1888 1440.2685 1440.3565 1443.9619 1444.4021 1449.1257 1449.4259 1455.7128 1456.0981 1644.3292 1718.6317 2115.0449 2115.8679 2982.6227 2982.6231 2984.0083 2984.1317 3081.0098 3081.0537 3083.4978 3083.6744 3096.4514 3096.4652 3097.2696 3097.3149 3142.2899 3160.3264 3173.6037 3190.4945
redmass: 3.7504 2.7816 3.2197 3.7478 2.8931 1.4332 1.0466 1.5778 1.0854 1.0722 2.5813 2.8158 2.5121 3.7853 3.7952 3.5099 4.7500 3.4603 3.7699 5.2072 5.9132 3.9385 1.1163 1.0699 3.7890 1.3777 6.4687 1.3328 4.6438 2.8867 2.5766 1.2225 1.2057 1.4099 1.4017 1.2134 1.2163 1.2827 1.2881 1.4291 1.3798 1.4575 1.4092 2.5545 2.3456 9.5047 7.1218 7.4647 1.0863 1.2023 1.2024 1.3752 1.1923 1.3092 1.2197 1.4641 1.0523 1.0522 1.0547 1.0549 1.0483 1.0518 1.0484 1.0484 8.1308 6.8586 1.0408 1.0408 1.0345 1.0345 1.0344 1.0343 1.0979 1.0979 1.0973 1.0972 1.0986 1.0986 1.0986 1.0985 1.0843 1.0857 1.1001 1.1008
irintensity: 0.0256 0.0000 0.0397 0.0000 0.0015 4.9439 0.0000 2.4465 0.1290 0.0061 0.9018 0.0011 5.9617 0.0003 45.3035 3.1179 1.5115 4.4169 0.0007 32.7754 0.0000 2.4172 1.4390 0.0314 38.3674 40.4025 3.7041 56.9199 0.0080 0.0106 24.5837 31.4152 46.8689 0.0179 63.1542 0.0003 0.0001 0.0248 246.5867 172.2269 68.2700 741.8387 1.9322 175.4019 53.0224 1.6892 25.5732 270.4465 1.6413 0.0191 89.5559 28.1747 29.9786 144.7681 0.0149 112.9528 0.0001 4.4438 0.0073 1.2981 24.1843 2.0825 19.5074 4.6727 97.0606 0.9696 30.1501 209.5357 22.3519 1.3326 23.9168 9.6502 0.2585 1.3941 68.0166 19.0320 6.0325 18.2232 18.3579 17.3261 0.0299 0.8482 29.5983 12.3680
temp: 298.150 k
press: 1.00000 atm
elementType: 14 14 7 7 6 6 6 6 6 6 6 6 1 1 1 1 1 1 1 1 1 1 1 1 1 1 1 1 1 1
symmnumber: 1
zpe: 630816.7 jmol-1
zpe.correction: 0.240265 hartree
zpe.thermalcorrener: 0.256929 hartree
zpe.thermalcorrenthalpy: 0.257873 hartree
zpe.thermalcorrgfe: 0.194575 hartree
zpe.sumelectzpe: -1002.973716 hartree
zpe.sumelectthermal: -1002.957053 hartree
zpe.sumelectthermalent: -1002.956109 hartree
zpe.sumelectthermalfe: -1003.019407 hartree
dipole: 0.0000 0.0000 -1.0548
dipole: 1.0548
quadrupole: -78.8602 -94.4341 -86.6821
quadrupole: -0.0154 0.0000 0.0015
quadrupole: 7.7986 -7.7753 -0.0233 -0.0154 0.0000 0.0015
hfenergy: -1003.2139819 hartree
pointgroup: C01 [X(C8H18N2Si2)]
dipole: -0.00001 0.0001837 0.4149783 debye
polarizability: 215.1045664|-0.4275404|117.0022555|-0.0018352|0.00195|125.4849484 unknown
InChI: InChI=1S/C8H18N2Si2/c1-11(2)9-5-7-10(8-6-9)12(3)4/h5-8,11-12H,1-4H3
charge 0 multiplicity 1
30 atoms
Si 3.265606 -0.001937 -0.279564
Si -3.265627 0.002081 -0.279417
N  1.469242 0.001859 -0.301969
N  -1.469264 -0.002498 -0.301896
C  0.680681 0.000875 0.901734
C  0.68012 -0.000253 -1.507924
C  -0.680645 -0.001164 0.901767
C  -0.680203 -0.001482 -1.507889
C  3.943743 -1.579919 0.557177
C  3.942966 1.541747 0.618748
C  -3.94314 1.581107 0.555861
C  -3.943524 -1.540503 0.620378
H  3.640841 0.025477 -1.741746
H  -3.64093 -0.026557 -1.741559
H  1.226193 0.001911 1.849575
H  1.233923 -0.00015 -2.449711
H  -1.226112 -0.002119 1.849634
H  -1.234049 -0.00261 -2.44965
H  3.590574 -2.483799 0.030456
H  5.04989 -1.583816 0.551163
H  3.612527 -1.649057 1.610015
H  3.61823 1.566316 1.675495
H  5.048993 1.548821 0.606847
H  3.584575 2.46555 0.131726
H  -3.611812 1.651129 1.608605
H  -3.589684 2.484356 0.02825
H  -5.049286 1.585401 0.549923
H  -3.58533 -2.464898 0.134337
H  -3.618945 -1.564094 1.677195
H  -5.04955 -1.547277 0.60834
