program: Gaussian 09
title: 000144849
version: EM64L-G09RevD.01
frameworkgroup: C1[X(C8H4N2O3S)]
method: RPBEPBE
basis: SDD
operation: Freq
keyword: #p
keyword: freq=noraman
keyword: PBEPBE/SDD
title: #p freq=noraman PBEPBE/SDD
converged: YES YES NO NO
title: Mulliken charges:
elementType: S O O O N N C C C C C C C C H H H H
charge: 0.230621 -0.163196 -0.197322 -0.187912 0.024681 0.111610 0.290408 0.380566 -0.431396 -0.328559 -0.345457 -0.186937 0.110297 -0.446629 0.322879 0.272016 0.295094 0.249238
chargesum: 0.00000
title: Mulliken charges with hydrogens summed into heavy atoms:
elementType: S O O O N N C C C C C C C C
charge: 0.230621 -0.163196 -0.197322 -0.187912 0.024681 0.111610 0.290408 0.380566 -0.108517 -0.056543 -0.050363 0.062301 0.110297 -0.446629
polarizability: 2.59888115e+02 2.66279120e+00 1.23894590e+02 8.28150286e-04 -9.80178178e-05 4.60651469e+01
1716.lowfreq: -4.9890 -3.1638 -0.0011 0.0012 0.0015 3.2150 28.2755 48.0897 52.8237
frequency: 28.2730 48.0863 52.8192 101.8180 145.4156 153.2304 190.9845 220.5435 290.2488 384.2890 407.4907 420.6835 443.3544 461.8306 473.3862 515.1233 624.9356 651.7291 654.2584 684.5256 695.7747 741.1426 776.0326 832.0746 896.3156 963.6787 978.9907 988.9483 1013.0112 1077.0596 1086.7766 1110.2291 1174.6643 1212.1833 1248.7221 1284.1230 1379.6568 1402.1400 1433.6515 1468.8180 1573.4289 1598.5639 1613.8208 2042.5342 3154.8333 3171.2361 3178.3068 3188.4246
redmass: 14.0240 13.5355 14.3677 11.1679 12.8850 6.1798 4.8513 11.7882 9.1940 8.6977 11.8681 3.3798 7.5310 9.5274 6.9981 7.1016 10.0489 5.7108 8.9537 10.2562 2.4634 6.0478 12.0364 1.5192 7.4960 1.4036 1.4679 6.2192 1.3690 1.6578 1.6004 8.8395 1.1368 8.0713 4.0762 1.4632 11.0549 7.9479 3.0863 2.7969 9.2322 8.4966 7.1791 12.7913 1.0880 1.0939 1.0926 1.0976
irintensity: 0.1106 0.0729 0.7535 0.0264 2.7078 2.0387 0.1010 0.1697 4.7183 1.1194 7.0315 0.2258 0.0863 1.7894 0.0003 5.0431 38.8663 2.4816 13.8421 128.7027 59.4930 13.6752 24.9174 26.1861 83.0300 0.0485 17.4610 1.5978 0.5107 50.8721 21.1958 100.3039 52.9416 480.3044 266.7436 58.9985 102.5864 5.8910 24.6763 22.6556 113.2262 93.6317 41.2926 1642.9259 4.4866 2.7549 10.9615 4.7043
temp: 298.150 k
press: 1.00000 atm
elementType: 16 8 8 8 7 7 6 6 6 6 6 6 6 6 1 1 1 1
symmnumber: 1
zpe: 288528.3 jmol-1
zpe.correction: 0.109895 hartree
zpe.thermalcorrener: 0.122016 hartree
zpe.thermalcorrenthalpy: 0.122960 hartree
zpe.thermalcorrgfe: 0.068975 hartree
zpe.sumelectzpe: -1039.431216 hartree
zpe.sumelectthermal: -1039.419095 hartree
zpe.sumelectthermalent: -1039.418151 hartree
zpe.sumelectthermalfe: -1039.472136 hartree
dipole: 2.2966 4.8969 0.0001
dipole: 5.4087
quadrupole: -106.6341 -86.2711 -85.6674
quadrupole: -4.5786 -0.0002 0.0001
quadrupole: -13.7765 6.5864 7.1901 -4.5786 -0.0002 0.0001
hfenergy: -1039.5411111 hartree
pointgroup: C01 [X(C8H4N2O3S1)]
dipole: -0.8074015 1.9688072 -0.0005902 debye
dipolederiv: -1.234461 0.1444015 -0.0000439 0.1583076 0.0218315 0.0000013 -0.0000611 0.0000028 0.0251536 -0.8837133 -0.1283943 0.0000358 0.3495977 -0.9152625 0.0001659 -0.0001025 0.0001826 -0.2977398 -0.9122455 -0.1189113 0.0000307 -0.0164415 -0.500224 0.0000741 -0.000018 0.0000561 -0.2216984 -0.5801165 0.1132123 -0.0000359 0.1254993 -0.7613135 0.0001183 -0.0000349 0.0001533 -0.2134256 1.6590432 -0.1921974 0.0000645 -0.3616794 1.1578793 -0.0002284 0.0000957 -0.0002317 0.1883496 -3.5046505 0.3916545 -0.0001162 0.3047667 -0.3529106 0.000069 -0.000067 0.000064 -0.1033919 -0.6796093 -0.1134044 0.0000351 -0.2102519 -0.2538415 0.0000662 0.0000547 0.0000662 -0.0185369 -0.452593 0.1317457 -0.0000416 0.0931229 -0.1752651 0.0000604 -0.0000116 0.0000541 0.0576606 0.2797817 -0.0298049 0.000006 -0.0361622 -0.0702369 0.000008 0.0000161 0. -0.0520782 0.0943397 -0.050174 0.000014 0.1814804 0.0741131 -0.000044 -0.0000579 -0.0000464 -0.0829786 0.0333337 0.0437948 -0.0000156 -0.2200133 0.0594477 -0.0000408 0.0000641 -0.0000419 -0.0814576 -0.4361493 0.0175302 -0.0000038 0.0627171 0.2102569 -0.0000972 -0.0000161 -0.0000958 -0.1359499 3.2162055 0.0091654 -0.0000081 -0.4965142 1.2938535 -0.0002763 0.0001322 -0.0002812 0.2851355 3.0222613 -0.223364 0.0000768 -0.0108671 -0.0395917 0.0000102 0.0000269 0.0000081 -0.0004423 0.2046907 -0.0074516 0.0000026 -0.0061687 0.1054623 0.0000172 -0.000002 0.0000157 0.1701027 0.0297693 0.0658592 -0.000018 0.1191582 0.0911831 0.0000173 -0.0000323 0.0000166 0.1522417 0.0757926 -0.0550376 0.0000177 -0.0208621 0.1260774 0.000014 0.0000098 0.0000117 0.1711868 0.0683205 0.001376 -0.0000001 -0.0156896 -0.071459 0.0000647 0.0000039 0.0000659 0.1578685 unknown
polarizability: 259.2948127|-9.3500645|124.4878867|0.002931|-0.0215009|46.0651528 unknown
InChI: InChI=1S/C8H4N2O3S/c11-8(9-5-14)6-2-1-3-7(4-6)10(12)13/h1-4H
charge 0 multiplicity 1
18 atoms
S  -5.655559 0.385333 0.000024
O  -1.739151 -1.919095 0.000689
O  4.420321 -0.007725 0.000167
O  3.257763 -1.970377 0.000635
N  3.321688 -0.683935 0.000277
N  -2.828515 0.14856 0.000112
C  -0.382973 0.100814 0.00011
C  2.040009 0.07854 0.0001
C  0.828396 -0.632889 0.00031
C  -0.356054 1.51963 -0.000285
C  2.09073 1.49068 -0.000289
C  0.876253 2.207931 -0.000483
C  -1.664972 -0.665025 0.000317
C  -4.054996 0.200253 0.000096
H  0.817246 -1.726705 0.000598
H  -1.301319 2.071114 -0.000438
H  3.061577 1.993251 -0.000445
H  0.892057 3.301846 -0.000794
