program: Gaussian 09
title: 000144848
version: EM64L-G09RevD.01
frameworkgroup: C1[X(C4H4F2NP)]
method: RPBEPBE
basis: SDD
operation: Freq
keyword: #p
keyword: freq=noraman
keyword: PBEPBE/SDD
title: #p freq=noraman PBEPBE/SDD
converged: YES YES NO NO
title: Mulliken charges:
elementType: P F F N C C C C H H H H
charge: 1.181133 -0.419085 -0.419181 -0.601173 -0.143343 -0.120439 -0.259844 -0.259632 0.259869 0.279167 0.250863 0.251665
chargesum: 0.00000
title: Mulliken charges with hydrogens summed into heavy atoms:
elementType: P F F N C C C C
charge: 1.181133 -0.419085 -0.419181 -0.601173 0.116526 0.158728 -0.008980 -0.007967
polarizability: 9.72750594e+01 2.05362317e+00 6.67232531e+01 1.20504660e-01 5.49150591e-01 4.08727650e+01
1716.lowfreq: -15.9685 -9.2949 -2.1606 -0.0024 -0.0012 0.0014 34.0818 102.2892 153.1446
frequency: 33.3462 102.2829 153.1380 255.6930 261.9508 352.9698 503.4071 596.4417 599.6756 665.7127 682.7732 693.5387 725.7249 848.1213 853.5060 891.1658 916.3073 1034.9498 1063.8216 1076.2602 1172.0501 1228.3606 1271.2797 1390.3588 1456.1910 1533.1045 3207.3863 3218.4984 3237.4591 3255.4186
redmass: 5.0416 7.5890 6.7657 8.8292 11.3237 9.9131 12.8110 3.2485 3.1304 14.7240 1.3105 21.9738 1.2353 1.3060 5.8238 1.3652 3.3787 1.8000 1.3517 1.4748 3.6578 2.1583 1.7925 2.8266 4.0265 4.6976 1.0889 1.0945 1.1050 1.1087
irintensity: 1.4396 0.1539 7.3318 2.9927 10.1425 3.8590 112.6693 2.4424 5.7896 102.9124 8.0232 98.7067 160.9829 0.4729 0.1309 0.0263 0.1258 82.2322 19.2406 89.6994 105.4673 14.7537 3.5478 0.4771 50.9820 2.5578 4.0681 0.8906 0.5667 4.8249
temp: 298.150 k
press: 1.00000 atm
elementType: 15 9 9 7 6 6 6 6 1 1 1 1
symmnumber: 1
zpe: 199063.9 jmol-1
zpe.correction: 0.075819 hartree
zpe.thermalcorrener: 0.083595 hartree
zpe.thermalcorrenthalpy: 0.084539 hartree
zpe.thermalcorrgfe: 0.042116 hartree
zpe.sumelectzpe: -749.920196 hartree
zpe.sumelectthermal: -749.912421 hartree
zpe.sumelectthermalent: -749.911477 hartree
zpe.sumelectthermalfe: -749.953899 hartree
dipole: 1.6033 -1.9658 -0.0933
dipole: 2.5384
quadrupole: -51.5129 -46.4198 -58.9195
quadrupole: 3.4552 0.1994 0.3648
quadrupole: 0.7712 5.8642 -6.6354 3.4552 0.1994 0.3648
hfenergy: -749.9960153 hartree
pointgroup: C01 [X(C4H4F2N1P1)]
dipole: -0.653251 -0.723697 0.2166129 debye
dipolederiv: 2.1912113 -0.2205478 0.0669088 0.078341 1.0814271 0.0710609 -0.0262311 0.0687363 1.3086986 -0.5931023 0.0450151 0.0962316 -0.2418073 -0.3403932 0.2377584 0.3556253 0.0131815 -0.6882624 -0.5833303 -0.0147916 -0.1032308 -0.3863247 -0.5610866 -0.3250161 -0.15946 -0.0966939 -0.470416 -1.5850771 0.2329223 -0.077595 0.5131659 -0.298044 0.0266676 -0.1676848 0.0262174 -0.2312922 0.6639497 -0.0050901 0.0105267 0.3180737 -0.1503388 -0.0185096 -0.0794741 -0.0214086 -0.2209165 0.2197419 -0.11858 0.0370114 -0.4933259 0.0382599 -0.0480451 0.1455604 -0.043603 -0.1045222 -0.1763827 0.082069 -0.0219452 0.3011374 -0.0271382 -0.0477878 -0.0837888 -0.0494078 -0.1932514 -0.2952569 -0.0189589 0.005071 -0.1004603 0.0519431 -0.0720642 0.0268897 -0.0719863 -0.1835843 0.0882465 0.0589319 -0.018128 0.01119 0.017494 0.0583609 -0.004693 0.0588377 0.2081376 0.0645359 -0.0530416 0.0127535 -0.0105477 0.0766847 0.0374562 0.0004976 0.0360848 0.2006881 -0.0314037 -0.0691188 0.0168126 -0.0574745 0.0896967 0.0310218 0.0137534 0.0308981 0.1942583 0.0368676 0.0811905 -0.0244168 0.0680325 0.0214952 0.049097 -0.0209947 0.0491438 0.1804623 unknown
polarizability: 97.1251923|-2.7116112|65.0180829|1.2378759|-6.7078315|42.7278024 unknown
InChI: InChI=1S/C4H4F2NP/c5-8(6)7-3-1-2-4-7/h1-4H
charge 0 multiplicity 1
12 atoms
P  1.657412 -0.712643 0.224896
F  2.233733 -0.063419 -1.2868
F  2.213279 0.6663 1.134173
N  -0.038528 -0.239416 0.074127
C  -1.11258 -1.140157 0.313739
C  -0.571287 1.020102 -0.285844
C  -2.298269 -0.446711 0.105542
C  -1.957425 0.911021 -0.270965
H  -0.93195 -2.173364 0.605673
H  0.080418 1.860161 -0.512059
H  -3.300704 -0.859314 0.209797
H  -2.656399 1.71344 -0.50318
