program: Gaussian 09
title: 000144831
version: EM64L-G09RevD.01
frameworkgroup: C1[X(C26H28O)]
method: RPBEPBE
basis: SDD
operation: Freq
keyword: #pfreq=noraman
keyword: PBEPBE/SDD
title: #p freq=noraman PBEPBE/SDD
converged: YES YES NO NO
title: Mulliken charges:
elementType: O C C C C C C C C C C C C C C C C C C C C C C C C C C H H H H H H H H H H H H H H H H H H H H H H H H H H H H
charge: -0.420361 0.113509 0.092328 -0.022183 0.026266 0.338803 0.353676 0.366687 0.333134 0.291861 0.482610 -0.632994 -0.638158 0.474229 -0.619019 -0.620438 -0.864877 -0.876505 -0.868112 -0.834468 -0.403445 -0.405080 -0.821264 -0.815544 -0.246022 -0.247878 -0.258137 0.233016 0.233889 0.239306 0.240408 0.252671 0.224163 0.237440 0.238213 0.221862 0.245796 0.226056 0.266450 0.242796 0.228629 0.241589 0.241643 0.255933 0.254996 0.221260 0.221823 0.232611 0.236896 0.225949 0.224811 0.362691 0.222613 0.222599 0.225274
chargesum: 0.00000
title: Mulliken charges with hydrogens summed into heavy atoms:
elementType: O C C C C C C C C C C C C C C C C C C C C C C C C C C
charge: -0.057670 0.113509 0.092328 -0.022183 0.026266 0.338803 0.353676 0.366687 0.333134 0.291861 0.482610 -0.399978 -0.404268 0.474229 -0.379713 -0.380030 -0.150603 -0.170634 -0.132810 -0.122607 -0.147513 -0.150084 -0.145570 -0.127888 -0.023408 -0.025280 -0.032863
polarizability: 3.83592010e+02 3.82193053e+00 2.61323216e+02 -9.39830742e+00 3.24232985e+00 2.41782331e+02
1716.lowfreq: -64.2666 -13.1038 -9.5311 -4.5036 -0.0010 -0.0007 -0.0005 3.8685 25.0303
frequency: -64.1679 -11.4019 24.8180 26.6917 34.6051 38.2865 44.9099 50.6229 57.8135 89.7620 97.1118 106.5171 116.6542 130.8183 156.3521 160.0384 179.9495 186.9774 191.3283 210.4780 223.3203 227.0227 247.7193 253.7901 268.3678 272.1401 306.8377 320.7902 338.7323 375.7339 406.0497 414.5950 422.6346 439.6129 470.4553 490.0476 508.0605 514.7771 522.3846 523.5427 526.1179 556.9087 561.9611 568.8298 577.1332 597.0792 599.6150 616.0223 658.4210 694.4952 700.0327 733.4017 745.9944 773.7190 799.8525 848.2564 862.7181 864.6770 890.6759 895.4300 902.1589 917.6266 933.3479 935.8100 952.0439 956.2593 976.5291 986.6806 992.8150 1015.4244 1016.0505 1016.4512 1018.7147 1022.7084 1028.7502 1036.6594 1039.5407 1042.2673 1044.0382 1045.2782 1048.1093 1049.9322 1050.4269 1086.2825 1136.3808 1167.1189 1170.7888 1180.4156 1194.5089 1228.3434 1241.9665 1251.5398 1253.2485 1296.8557 1315.1563 1316.9341 1323.5631 1351.8390 1356.0377 1371.7369 1390.2022 1393.6020 1395.0557 1396.6694 1399.9606 1402.6323 1412.8126 1414.4817 1431.8271 1439.0375 1446.9790 1460.9695 1462.3175 1462.9134 1463.6488 1472.1906 1472.6948 1473.0551 1473.5211 1479.0498 1482.0331 1484.5469 1491.1204 1496.0885 1572.5887 1575.3382 1579.8371 1605.6821 1616.9496 1618.8101 1654.1658 2970.9999 2972.7523 2973.9903 2974.8531 2974.9516 2981.3516 3051.4793 3052.7733 3053.5584 3055.0579 3056.2252 3063.5940 3077.9610 3079.6835 3080.0068 3085.1825 3086.7900 3089.7418 3106.7425 3111.3701 3114.6649 3118.8908 3120.1690 3129.0120 3144.0214 3156.5574 3168.1646 3551.5356
redmass: 1.0487 1.0121 2.6734 1.1278 3.9541 3.8176 4.0400 4.1039 3.8557 4.1452 1.3319 1.4136 1.8474 2.5577 4.3945 4.4896 1.1120 2.9570 2.7934 4.3952 2.9375 2.7620 4.1851 4.0532 2.5188 2.5460 2.9581 2.8598 5.8524 4.5897 2.8538 1.1284 4.3498 4.4836 3.0664 3.1521 4.5592 4.0064 3.3860 3.0502 4.2328 4.3821 4.1255 3.6436 4.0938 3.7722 3.8179 6.2676 5.5282 5.2162 1.7317 3.7806 3.9071 2.2615 3.7900 1.2496 1.3251 1.2987 1.3128 1.3122 4.5463 1.5308 2.4323 2.2288 3.3518 3.6121 1.3790 6.0411 1.3120 1.6518 1.7532 1.6222 1.7700 4.0111 2.2134 1.7365 1.7134 1.5539 1.5918 1.5384 1.5443 1.6295 1.6143 1.6599 2.7770 2.0399 1.0605 1.4734 1.1182 1.8603 2.2706 1.4521 1.4671 2.9492 6.5139 3.2410 1.8953 6.9532 6.8554 5.9696 1.2494 1.2438 1.2537 1.2278 1.3512 1.2224 2.4400 2.3258 2.3184 2.0211 1.7908 1.0655 1.0583 1.0695 1.0801 1.0768 1.0683 1.0551 1.0818 1.1864 1.7215 1.4274 1.5217 1.3521 6.7906 5.7452 7.0793 6.0072 5.8113 5.9564 8.2848 1.0383 1.0367 1.0398 1.0367 1.0385 1.0373 1.0951 1.0966 1.0935 1.0966 1.0949 1.0962 1.0995 1.0992 1.0996 1.0998 1.0997 1.0998 1.0907 1.0915 1.0909 1.0918 1.0844 1.0883 1.0932 1.0967 1.0977 1.0656
irintensity: 0.3613 0.3932 0.2812 0.4247 0.1169 0.0269 0.2654 0.0904 0.0675 0.1771 0.5436 0.6938 0.0764 0.0821 3.2087 0.4934 1.3070 1.4518 4.9619 3.0837 0.1759 0.0609 1.5249 3.7745 0.1420 1.3659 2.5251 0.2444 5.8418 1.3016 0.6829 81.2290 3.4383 2.2863 1.0710 0.7745 2.3583 2.5780 2.2859 0.1194 0.5610 2.4478 1.3249 0.3820 1.3206 7.1832 4.0028 0.0847 20.8585 1.0749 50.1929 25.1081 0.6090 44.8673 13.7338 0.8128 19.5893 24.6166 0.0621 0.1341 35.1413 5.6711 0.2028 1.6907 2.9299 0.9710 0.7260 0.1432 0.2316 14.9223 7.5036 6.2035 8.6877 13.5986 1.3829 0.7199 0.9414 2.3641 4.9677 4.6909 1.6547 52.0314 9.3731 3.8731 77.0112 20.7799 0.0396 34.9272 0.4526 14.6504 45.3109 0.2401 1.2521 33.7448 1.2074 1.7237 3.1090 0.5063 0.6377 2.8894 10.3298 9.1176 5.7302 13.1719 20.2628 1.7064 0.0951 2.7547 3.4302 7.3302 14.0609 30.1550 2.7932 1.0356 3.8471 1.8215 12.7826 7.5551 14.8156 16.2285 32.2812 55.3661 71.2375 14.2761 7.8398 0.8610 14.9197 27.2963 22.7562 22.1582 64.2411 59.4818 33.0053 26.7434 12.5305 41.4312 17.9171 20.6940 21.8201 12.4810 17.0851 23.2949 10.8404 31.2816 27.9927 26.7542 14.0798 19.7481 19.9287 33.2549 26.3209 26.3175 20.3566 1.7702 7.2855 24.9325 36.7484 12.8177 42.7725
temp: 298.150 k
press: 1.00000 atm
elementType: 8 6 6 6 6 6 6 6 6 6 6 6 6 6 6 6 6 6 6 6 6 6 6 6 6 6 6 1 1 1 1 1 1 1 1 1 1 1 1 1 1 1 1 1 1 1 1 1 1 1 1 1 1 1 1
symmnumber: 1
zpe: 1196952.8 jmol-1
zpe.correction: 0.455895 hartree
zpe.thermalcorrener: 0.482497 hartree
zpe.thermalcorrenthalpy: 0.483441 hartree
zpe.thermalcorrgfe: 0.397974 hartree
zpe.sumelectzpe: -1080.871409 hartree
zpe.sumelectthermal: -1080.844807 hartree
zpe.sumelectthermalent: -1080.843863 hartree
zpe.sumelectthermalfe: -1080.929330 hartree
dipole: 2.6467 -0.5939 0.1190
dipole: 2.7151
quadrupole: -143.2830 -157.5058 -153.6892
quadrupole: -2.5504 -2.3560 0.5299
quadrupole: 8.2097 -6.0131 -2.1965 -2.5504 -2.3560 0.5299
hfenergy: -1081.3273046 hartree
pointgroup: C01 [X(C26H28O1)]
dipole: -1.021188 -0.3134694 0.0029398 debye
polarizability: 382.7589154|4.6842345|260.9142889|-13.7597133|-5.2063374|243.0243521 unknown
InChI: InChI=1S/C26H28O/c1-16-12-18(3)23(19(4)13-16)25(22-10-8-7-9-11-22)26(27)24-20(5)14-17(2)15-21(24)6/h7-15,27H,1-6H3
charge 0 multiplicity 1
55 atoms
O  0.229497 -2.30989 0.05868
C  2.005076 -0.199201 -0.067382
C  0.517643 0.057704 -0.034136
C  -1.847516 -1.027457 0.053874
C  -0.350032 -1.00587 0.012843
C  2.781856 0.05984 1.103007
C  2.651723 -0.666653 -1.249361
C  -2.622925 -0.738888 -1.111003
C  -2.498359 -1.417218 1.268741
C  0.075801 1.483433 -0.036325
C  4.841229 -0.601825 -0.097407
C  4.181895 -0.144643 1.068484
C  4.055394 -0.852197 -1.247047
C  -4.696273 -1.24089 0.148378
C  -4.031873 -0.85319 -1.040264
C  -3.908816 -1.521129 1.291791
C  2.125481 0.54131 2.385662
C  1.862004 -0.972384 -2.509622
C  -1.96804 -0.29735 -2.406785
C  -1.702714 -1.658819 2.543032
C  0.905499 2.457678 -0.667899
C  -1.125451 1.943695 0.580477
C  6.341627 -0.842038 -0.106186
C  -6.211296 -1.329581 0.202237
C  0.542078 3.820257 -0.70417
C  -1.488261 3.306286 0.54331
C  -0.661219 4.255373 -0.102175
H  4.769188 0.055898 1.974104
H  4.544854 -1.202656 -2.165185
H  -4.624621 -0.635413 -1.937771
H  -4.403482 -1.818553 2.225129
H  1.699392 1.555508 2.268758
H  2.852181 0.57079 3.215834
H  1.29119 -0.122573 2.679568
H  1.168587 -0.151328 -2.767835
H  2.533581 -1.141181 -3.369237
H  1.252151 -1.884764 -2.367301
H  -2.705863 -0.249422 -3.225655
H  -1.515316 0.705523 -2.294671
H  -1.155908 -0.981096 -2.711231
H  -2.349782 -2.049585 3.346273
H  -0.867629 -2.365655 2.392218
H  -1.248312 -0.714911 2.903473
H  1.845731 2.134693 -1.127958
H  -1.774888 1.236203 1.102969
H  6.766749 -0.710815 -1.117169
H  6.866787 -0.151906 0.578054
H  6.582124 -1.873115 0.219834
H  -6.656207 -0.351941 0.472513
H  -6.635171 -1.621856 -0.774692
H  -6.548663 -2.062511 0.956017
H  -0.496294 -2.979877 -0.024716
H  1.199579 4.542846 -1.201224
H  -2.415178 3.630471 1.030785
H  -0.943804 5.31387 -0.125337
