program: Gaussian 09
title: 000144827
version: EM64L-G09RevD.01
frameworkgroup: C1[X(C14H10)]
method: RPBEPBE
basis: SDD
operation: Freq
keyword: #p
keyword: freq=noraman
keyword: PBEPBE/SDD
title: #p freq=noraman PBEPBE/SDD
converged: YES YES NO YES
title: Mulliken charges:
elementType: C C C C C C C C C C C C C C H H H H H H H H H H
charge: -0.236788 -0.236789 -0.449284 -0.449285 0.363740 0.363739 -0.642652 -0.642653 0.388310 0.388309 -0.432447 -0.432447 -0.245281 -0.245281 0.270894 0.270895 0.272525 0.272525 0.250002 0.250003 0.236409 0.236409 0.224573 0.224573
chargesum: 0.00000
title: Mulliken charges with hydrogens summed into heavy atoms:
elementType: C C C C C C C C C C C C C C
charge: 0.034106 0.034106 -0.176759 -0.176759 0.363740 0.363739 -0.392650 -0.392650 0.388310 0.388309 -0.196038 -0.196038 -0.020707 -0.020707
polarizability: 2.37581228e+02 1.85550510e-06 1.37225185e+02 8.72896020e-03 2.82578792e-03 7.09425420e+01
1716.lowfreq: -0.0008 -0.0006 0.0006 1.8692 7.8723 8.1992 91.5194 138.9138 226.8106
frequency: 91.5194 138.9129 226.8106 244.1343 300.9291 377.1435 379.5898 390.7937 478.3130 557.0540 559.8180 575.3197 603.8893 682.1582 690.0139 703.4662 739.4725 740.1254 755.6675 759.5023 778.5927 802.5122 835.5394 862.3108 872.2493 890.4859 898.6006 911.7263 923.7732 928.0130 960.5409 980.4637 985.2412 1025.9158 1073.3418 1080.0767 1082.9868 1143.2308 1148.5695 1166.3707 1169.9406 1178.8142 1212.1075 1238.6088 1238.9600 1262.2813 1338.1856 1357.2864 1405.7457 1428.8596 1450.3703 1458.7195 1519.6668 1612.4956 1618.3358 1659.9950 3114.5055 3119.3126 3125.3254 3128.4603 3138.2181 3158.8405 3176.7388 3178.7515 3209.4836 3234.1799
redmass: 4.7672 3.5430 4.7912 4.4401 3.6895 6.9082 3.0973 4.3476 2.5345 6.3593 3.5107 3.5457 6.8144 5.7444 6.7092 2.4291 5.4448 1.4552 2.3812 1.2623 3.7217 2.9808 3.0594 1.3535 2.3725 1.0971 1.4340 2.0135 1.7797 5.9867 1.4181 1.3348 1.3348 2.2759 1.6121 2.4532 1.3658 1.6582 1.4429 1.3194 2.7284 1.4312 1.7066 3.6815 1.4403 2.2661 1.6864 3.2515 8.0555 2.0635 2.9744 4.7183 4.4742 8.2381 6.2614 8.0352 1.0856 1.0892 1.0921 1.0919 1.0942 1.1003 1.0916 1.0946 1.0916 1.1143
irintensity: 3.1438 0.0000 0.3172 2.2197 0.0000 0.2374 1.2524 0.0026 19.4049 0.6942 0.0000 0.9008 7.0720 7.6001 0.0000 43.9615 0.0000 4.5359 1.0571 77.3941 0.0000 0.0000 3.5433 0.0000 3.8030 0.0000 48.3049 2.9979 0.0000 18.3991 13.1142 0.1293 0.0000 5.9591 40.4273 3.8571 0.0000 3.3364 6.6539 0.9424 0.0002 0.1394 0.8154 6.8282 0.0157 7.3762 0.3709 3.5447 1.3346 3.8970 3.7148 37.9383 1.7853 2.1724 0.6537 0.2385 5.4134 0.1605 21.6821 2.0582 38.9698 41.9359 17.7609 9.6201 2.8051 12.2159
temp: 298.150 k
press: 1.00000 atm
elementType: 6 6 6 6 6 6 6 6 6 6 6 6 6 6 1 1 1 1 1 1 1 1 1 1
symmnumber: 1
zpe: 496924.9 jmol-1
zpe.correction: 0.189269 hartree
zpe.thermalcorrener: 0.198659 hartree
zpe.thermalcorrenthalpy: 0.199603 hartree
zpe.thermalcorrgfe: 0.154685 hartree
zpe.sumelectzpe: -538.475116 hartree
zpe.sumelectthermal: -538.465725 hartree
zpe.sumelectthermalent: -538.464781 hartree
zpe.sumelectthermalfe: -538.509700 hartree
dipole: 2.0422 0.0000 0.0001
dipole: 2.0422
quadrupole: -66.1176 -70.9479 -86.1637
quadrupole: 0.0000 0.0010 0.0006
quadrupole: 8.2921 3.4619 -11.7540 0.0000 0.0010 0.0006
hfenergy: -538.6643844 hartree
pointgroup: C01 [X(C14H10)]
dipole: -0.8034698 -0.0000005 0.0000274 debye
dipolederiv: -0.188767 0.0000013 -0.0023321 0.0000073 0.059981 -0.0000065 0.2889918 -0.0000061 -0.1722344 -0.1888033 -0.0000015 0.0023354 -0.0000052 0.0599795 -0.0000056 -0.2889896 -0.0000074 -0.1722129 -0.0556963 -0.0902521 0.0000051 -0.2331658 0.0864841 0.0000096 -0.0000057 0.0000033 0.0345808 -0.0556907 0.09025 -0.0000002 0.2331603 0.086487 -0.0000123 -0.000005 -0.0000058 0.034583 0.3699665 -0.0260441 -0.000021 -0.2480513 -0.0853163 0.0000131 -0.0000088 0.0000021 -0.0348661 0.3699597 0.0260461 -0.0000144 0.2480539 -0.0853144 -0.0000081 -0.0000041 -0.0000013 -0.0348664 -0.1784191 -0.0025714 -0.0000024 -0.0307341 0.1282658 -0.0000115 0.0000041 -0.0000071 -0.1961925 -0.1784161 0.0025711 -0.0000031 0.0307323 0.1282653 -0.0000146 -0.0000148 -0.0000088 -0.1961926 0.1238713 -0.0345608 -0.0000022 -0.1467573 -0.1275024 0.0000138 0.0000035 0.0000076 0.0394712 0.1238686 0.0345613 -0.0000077 0.1467581 -0.1275024 -0.0000015 -0.0000122 0.0000029 0.0394713 -0.0270104 0.0070574 -0.0000088 0.0733178 0.126095 -0.0000162 -0.0000119 -0.0000121 -0.1800151 -0.027009 -0.007058 -0.0000084 -0.0733191 0.1260957 -0.0000094 -0.0000028 -0.0000115 -0.1800149 -0.0313697 0.0948534 -0.0000126 0.100633 0.0199271 -0.0000134 -0.0000142 -0.0000136 -0.1736098 -0.03137 -0.0948536 -0.0000048 -0.100633 0.0199256 -0.0000021 -0.0000043 -0.0000021 -0.1736099 -0.0208913 0.0000034 0.1189389 0.0000027 0.0712878 -0.0000011 0.1136372 -0.0000006 0.0423166 -0.0209067 -0.0000035 -0.1189286 -0.0000013 0.0712881 -0.0000002 -0.1136292 -0.0000013 0.0423341 -0.0250807 0.0251413 0.0000094 0.0733675 -0.0848516 0.0000019 0.0000087 0.0000056 0.1666104 -0.0250801 -0.0251413 0.000008 -0.0733668 -0.0848516 0.0000097 0.0000069 0.0000084 0.1666106 0.0641746 -0.0209572 0.0000053 0.0227844 -0.1044727 0.0000088 0.0000046 0.0000079 0.1562344 0.0641747 0.0209578 0.0000048 -0.0227837 -0.1044722 0.0000119 0.0000052 0.0000065 0.1562345 0.0765575 0.0404582 0.0000027 -0.0367296 -0.1219091 0.0000131 0.0000055 0.000009 0.1553609 0.0765573 -0.0404571 0.0000062 0.0367306 -0.1219096 0.0000097 0.0000031 0.0000143 0.1553608 -0.1073095 -0.0995256 0.0000196 -0.1064604 0.0320097 0.0000114 0.0000204 0.000011 0.1623231 -0.1073101 0.0995249 0.0000109 0.1064597 0.0320106 -0.0000006 0.0000113 -0.0000009 0.1623232 unknown
polarizability: 237.5812279|0.0001924|137.2251849|-0.008729|-0.0028258|70.942542 unknown
InChI: InChI=1S/C14H10/c1-2-4-8-6-10-9(5-7(8)3-1)11-13-12(10)14(11)13/h1-6,11-14H
charge 0 multiplicity 1
24 atoms
C  -3.499959 0.00002 0.746406
C  -3.500019 -0.00001 -0.745712
C  -2.692681 1.107187 0.000291
C  -2.692677 -1.107173 0.000344
C  -1.23735 0.723591 0.000222
C  -1.237347 -0.72357 0.000291
C  -0.054806 1.442288 0.000124
C  -0.054801 -1.442264 0.000257
C  1.200459 0.726423 0.000091
C  1.200462 -0.726394 0.000154
C  2.455299 1.415981 -0.000005
C  2.455305 -1.415947 0.000111
C  3.666149 0.714351 -0.000045
C  3.666152 -0.714312 0.000015
H  -4.244397 0.000042 1.538644
H  -4.244506 -0.000025 -1.537903
H  -3.045831 2.140254 0.000284
H  -3.045824 -2.140241 0.000382
H  -0.044663 2.538589 0.000083
H  -0.044654 -2.538565 0.000298
H  2.454619 2.513026 -0.000049
H  2.45463 -2.512993 0.000157
H  4.617967 1.257166 -0.000123
H  4.617972 -1.257123 -0.000016
