program: Gaussian 09
title: 000144823
version: EM64L-G09RevD.01
frameworkgroup: C1[X(C8H6O2)]
method: RPBEPBE
basis: SDD
operation: Freq
keyword: #p
keyword: freq=noraman
keyword: PBEPBE/SDD
title: #p freq=noraman PBEPBE/SDD
converged: YES YES NO YES
title: Mulliken charges:
elementType: O O C C C C C C C C H H H H H H
charge: -0.170720 -0.170722 -0.508253 -0.508253 0.168487 0.168491 -0.003618 -0.003617 -0.246265 -0.246265 0.249814 0.249737 0.249741 0.249811 0.260816 0.260816
chargesum: 0.00000
title: Mulliken charges with hydrogens summed into heavy atoms:
elementType: O O C C C C C C C C
charge: -0.170720 -0.170722 -0.008702 -0.008702 0.168487 0.168491 -0.003618 -0.003617 0.014551 0.014551
polarizability: 1.29480387e+02 -1.78406885e-04 9.12390589e+01 -6.30056016e-03 -5.41249603e-03 4.31098805e+01
1716.lowfreq: -4.7652 0.0001 0.0004 0.0005 4.6108 13.1974 97.4816 150.3620 177.7557
frequency: 97.4785 150.3618 177.7550 250.6105 271.3810 339.0883 412.9745 443.9694 533.6150 575.5408 577.7484 612.9558 738.3401 762.5781 784.4787 849.5776 875.7013 967.4083 990.4216 1006.7276 1013.5157 1054.9177 1073.9663 1118.4575 1178.4793 1180.2839 1200.0145 1324.4357 1335.3449 1358.7384 1431.9489 1441.2640 1530.7725 1565.0823 1578.5428 1642.7457 3022.4307 3029.2322 3085.6027 3100.4405 3133.3638 3158.9428
redmass: 9.2300 2.3357 3.4666 4.9978 3.9306 10.2853 2.9503 11.3019 7.2948 2.1772 4.1616 6.3262 6.5389 1.1686 5.0704 1.8811 3.2181 6.1248 1.2937 3.2572 2.0577 1.1662 3.6367 1.1347 1.3058 1.4668 1.5364 1.7712 6.2698 4.4313 1.1041 1.1366 11.2841 10.1263 7.7476 8.5974 1.0571 1.0620 1.1066 1.1047 1.0866 1.0995
irintensity: 11.4138 0.0000 3.9149 0.6905 0.0000 17.3018 0.0000 1.4290 0.1286 0.0080 0.4303 2.4239 1.0071 27.8432 0.0000 42.1622 0.9247 0.0105 0.0000 74.6128 0.0000 0.2461 27.1533 0.0000 2.8067 6.3100 21.7296 3.4980 37.0029 1.5748 14.1289 20.5852 5.4673 282.7515 38.1746 21.6225 10.7684 18.3148 0.0000 22.2037 1.1457 10.5751
temp: 298.150 k
press: 1.00000 atm
elementType: 8 8 6 6 6 6 6 6 6 6 1 1 1 1 1 1
symmnumber: 1
zpe: 304911.6 jmol-1
zpe.correction: 0.116135 hartree
zpe.thermalcorrener: 0.124264 hartree
zpe.thermalcorrenthalpy: 0.125208 hartree
zpe.thermalcorrgfe: 0.083093 hartree
zpe.sumelectzpe: -458.124432 hartree
zpe.sumelectthermal: -458.116302 hartree
zpe.sumelectthermalent: -458.115358 hartree
zpe.sumelectthermalfe: -458.157473 hartree
dipole: 0.0000 1.1925 -0.0003
dipole: 1.1925
quadrupole: -77.1034 -46.0849 -56.0350
quadrupole: 0.0002 0.0009 -0.0026
quadrupole: -17.3623 13.6562 3.7061 0.0002 0.0009 -0.0026
hfenergy: -458.2405663 hartree
pointgroup: C01 [X(C8H6O2)]
dipole: 0.0000937 0.4691841 -0.0001163 debye
dipolederiv: -0.9020755 -0.07718 -0.0004423 -0.0162286 -0.4653334 0.0000256 0.0001338 0.0000834 -0.3207751 -0.9020297 0.0773545 0.0005996 0.0164033 -0.465372 0.0000132 -0.0000836 0.0000889 -0.3207753 -0.0773287 0.0498432 -0.0000316 0.004917 -0.1037799 -0.0000429 -0.0001804 0.0000419 0.148322 -0.077351 -0.0498557 0.0000869 -0.0049283 -0.1037665 -0.0000354 0.000224 0.0000432 0.1483212 -0.1364315 -0.4927889 -0.0002255 -0.3826697 -0.1048273 0.0001889 0.0002906 -0.0001739 -0.0654822 -0.1360678 0.4928027 0.0001963 0.3826806 -0.1051755 0.0000975 -0.0002283 -0.0003605 -0.0654813 1.0184831 0.1154422 0.0004784 0.0777081 0.846125 -0.0002493 0.0002809 -0.0001582 0.2463487 1.0183943 -0.1155063 -0.0006049 -0.0777753 0.8462029 -0.0002341 -0.0004462 -0.0001519 0.2463483 -0.0840482 0.2819456 -0.0002385 0.2706725 -0.1804524 -0.0001331 0.000046 0.0001332 -0.1219744 -0.0842767 -0.2819879 0.0002119 -0.270712 -0.1802312 -0.000063 -0.0000246 0.000227 -0.1219752 0.0650609 0.0298318 -0.0652877 0.0473068 0.0275262 0.0601871 -0.0763651 0.0879346 -0.0208311 0.0650486 0.0297448 0.0653039 0.0471833 0.0276108 -0.0601401 0.0764218 -0.0879919 -0.021018 0.0649777 -0.0297894 -0.0653512 -0.0472122 0.0276421 -0.0600992 -0.0764758 -0.0879447 -0.0209659 0.0650687 -0.029818 0.0652892 -0.0473069 0.0275622 0.0601725 0.0763822 0.0879168 -0.0208825 0.0512659 -0.0710596 0.000039 -0.0384395 -0.0468425 0.0001637 -0.0000059 0.0001624 0.1554103 0.0513099 0.0710209 -0.0000235 0.0384009 -0.0468886 0.0001487 0.0000307 0.0001495 0.1554105 unknown
polarizability: 129.4803857|-0.0076375|91.2390605|-0.0063016|-0.0054113|43.1098805 unknown
InChI: InChI=1S/C8H6O2/c9-7-3-4-8(10)6-2-1-5(6)7/h3-4H,1-2H2
charge 0 multiplicity 1
16 atoms
O  -2.776955 -0.568457 -0.00014
O  2.776742 -0.569576 -0.000469
C  -0.799972 2.214465 0.000061
C  0.800895 2.214135 -0.000171
C  -0.688165 0.687379 -0.000572
C  0.688455 0.687096 -0.000736
C  -1.505325 -0.53968 -0.001148
C  1.505121 -0.540293 -0.001541
C  -0.685863 -1.8022 0.000092
C  0.685151 -1.802478 0.000003
H  -1.265489 2.655768 -0.897442
H  -1.265218 2.655056 0.898062
H  1.266595 2.654556 0.897669
H  1.266321 2.655219 -0.897837
H  -1.259183 -2.737287 0.000972
H  1.258089 -2.7378 0.000797
