program: Gaussian 09
title: 000144819
version: EM64L-G09RevD.01
frameworkgroup: C1[X(C10H22P2)]
method: RPBEPBE
basis: SDD
operation: Freq
keyword: #pfreq=noraman
keyword: PBEPBE/SDD
title: #p freq=noraman PBEPBE/SDD
converged: YES YES NO NO
title: Mulliken charges:
elementType: P P C C C C C C C C C C H H H H H H H H H H H H H H H H H H H H H H
charge: 0.339934 0.343163 -0.732497 -0.120590 -0.110427 -0.643690 -0.668244 -0.663253 -0.666645 -0.654297 -0.674029 -0.676044 0.295986 0.223147 0.219575 0.216407 0.245282 0.212197 0.207116 0.219655 0.235873 0.207669 0.220263 0.213244 0.225686 0.233046 0.201669 0.216755 0.223536 0.226547 0.210515 0.238893 0.211012 0.222544
chargesum: 0.00000
title: Mulliken charges with hydrogens summed into heavy atoms:
elementType: P P C C C C C C C C C C
charge: 0.339934 0.343163 -0.436511 -0.120590 -0.110427 0.015439 -0.003649 -0.000056 -0.007452 -0.002826 -0.013430 -0.003595
polarizability: 2.08252372e+02 -2.32477372e+00 1.46779289e+02 -5.98295089e+00 5.90360790e-01 1.32863422e+02
1716.lowfreq: -5.6733 0.0006 0.0018 0.0021 14.6987 20.1212 26.0328 64.2563 76.2075
frequency: 24.7722 63.7451 76.1899 89.9294 153.8273 171.5494 181.6382 207.0826 214.2672 223.1741 237.2427 255.1661 258.7239 260.2470 276.5541 277.8095 287.1818 289.4422 329.3044 349.1784 358.2774 375.1013 387.5969 388.8740 423.4245 460.3611 506.0904 534.0456 549.1910 640.4234 798.8786 799.1749 928.2622 932.1883 935.3881 938.2096 943.7125 944.2871 985.0284 997.0269 1009.0192 1013.4037 1015.6375 1018.2129 1067.2542 1101.2941 1167.6336 1172.7587 1206.2525 1211.2852 1221.4577 1224.6290 1280.0210 1372.0537 1373.4512 1373.6904 1374.0160 1389.3536 1398.6835 1401.8422 1451.3513 1455.0432 1457.6704 1459.9630 1461.7374 1465.6294 1469.5334 1470.5441 1475.9997 1478.6154 1479.5189 1480.1067 1489.6347 1491.3955 2959.4293 2960.8825 2962.7798 2963.5894 2964.8716 2968.2519 2972.8437 3047.8974 3051.8824 3052.9898 3053.3056 3057.8997 3058.3268 3064.7112 3068.4083 3073.4416 3074.3733 3077.5992 3078.9404 3085.4647 3094.3298 3100.4528
redmass: 2.8401 3.0254 3.5410 4.4900 3.7190 2.6931 1.2575 1.9217 1.1034 1.5041 1.1950 1.4050 1.2782 1.1642 1.4392 2.3538 2.1616 1.4169 3.1670 2.7958 2.8568 2.8743 2.3919 2.7207 3.8712 3.8963 3.8829 3.3494 4.5519 4.6716 3.0467 3.0233 1.6713 1.6380 1.5808 1.5952 1.2016 1.2025 1.1253 1.2740 1.4255 1.4194 1.4231 1.3663 1.4104 4.3666 2.0172 2.0032 2.8305 2.8923 3.0149 3.0564 1.2833 1.1920 1.1961 1.1929 1.1918 1.1931 1.1955 1.1926 1.0494 1.0494 1.0476 1.0479 1.0482 1.0476 1.0459 1.0477 1.0514 1.0503 1.0493 1.0504 1.0502 1.0501 1.0354 1.0355 1.0393 1.0362 1.0361 1.0378 1.0372 1.0978 1.0984 1.0987 1.0986 1.0968 1.0974 1.0940 1.1007 1.0993 1.1001 1.0992 1.0897 1.0983 1.0966 1.0946
irintensity: 0.0248 0.0451 0.3180 1.0490 0.1032 0.1134 0.1277 0.2001 0.0429 0.1124 0.0335 0.0502 0.1586 0.0604 0.0626 0.0229 0.1943 0.2115 0.5428 0.2030 0.4591 0.3394 0.1231 0.4193 0.9310 3.3989 1.3708 1.2201 0.2049 7.7890 2.0867 10.5743 2.2632 1.7270 1.1071 1.6586 0.0504 0.0397 4.7983 4.0987 1.8887 0.2891 2.7433 3.6232 9.9440 2.4820 136.7774 10.9414 3.3799 4.5939 2.1270 0.3549 4.7167 30.9576 12.8341 13.9176 38.3346 13.9210 11.5852 12.9118 1.7114 0.1665 0.8272 1.2197 1.1210 0.6268 17.5785 2.1345 18.0121 13.5815 20.8538 13.0712 20.6206 23.5477 25.5668 32.3629 27.0795 27.9500 83.7671 70.5884 50.3852 12.1619 17.8280 7.1020 17.6411 15.0139 98.9304 79.5249 6.5070 31.5659 23.1430 29.3832 1.3603 20.6598 43.7616 12.4136
temp: 298.150 k
press: 1.00000 atm
elementType: 15 15 6 6 6 6 6 6 6 6 6 6 1 1 1 1 1 1 1 1 1 1 1 1 1 1 1 1 1 1 1 1 1 1
symmnumber: 1
zpe: 776519.6 jmol-1
zpe.correction: 0.295761 hartree
zpe.thermalcorrener: 0.313292 hartree
zpe.thermalcorrenthalpy: 0.314236 hartree
zpe.thermalcorrgfe: 0.252005 hartree
zpe.sumelectzpe: -1075.708560 hartree
zpe.sumelectthermal: -1075.691029 hartree
zpe.sumelectthermalent: -1075.690084 hartree
zpe.sumelectthermalfe: -1075.752316 hartree
dipole: 0.0152 0.6226 -0.1239
dipole: 0.6350
quadrupole: -86.3415 -91.2996 -96.4202
quadrupole: 0.0243 1.3853 -1.4746
quadrupole: 5.0123 0.0542 -5.0665 0.0243 1.3853 -1.4746
hfenergy: -1076.0043204 hartree
pointgroup: C01 [X(C10H22P2)]
dipole: -0.0183313 -0.2441026 -0.0499498 debye
polarizability: 208.09929|-5.2302564|147.1400956|4.4892077|-0.6794333|132.6556979 unknown
InChI: InChI=1S/C10H22P2/c1-8(11-9(2,3)4)12-10(5,6)7/h8H,1-7H3
charge 0 multiplicity 1
34 atoms
P  0.868273 -0.243789 0.819475
P  -0.724768 0.349634 -0.837494
C  -0.025986 -1.417599 -0.422769
C  2.56952 0.260575 -0.033603
C  -2.40243 0.639293 0.154077
C  -0.825822 -2.596763 0.123691
C  2.688064 -0.103327 -1.527801
C  2.705728 1.792246 0.154047
C  3.665738 -0.478424 0.781715
C  -2.335599 0.415609 1.680369
C  -2.731984 2.131832 -0.126193
C  -3.489351 -0.259427 -0.492944
H  0.607112 -1.711422 -1.272953
H  -0.14044 -3.416188 0.414061
H  -1.420473 -2.333776 1.014007
H  -1.516841 -2.994971 -0.643832
H  1.878515 0.353308 -2.126472
H  3.653781 0.274355 -1.919572
H  2.674146 -1.197136 -1.688519
H  2.594005 2.083619 1.215377
H  1.937611 2.329567 -0.431152
H  3.704864 2.128854 -0.187392
H  3.577908 -1.57599 0.676885
H  4.668538 -0.18033 0.416103
H  3.60885 -0.231911 1.858203
H  -1.580886 1.071269 2.148289
H  -3.324153 0.647718 2.126855
H  -2.081085 -0.624545 1.944579
H  -2.800552 2.338697 -1.210394
H  -1.963133 2.800481 0.302728
H  -3.706297 2.389891 0.333859
H  -3.315147 -1.329057 -0.284305
H  -4.484511 0.009737 -0.085587
H  -3.526797 -0.124129 -1.59014
