program: Gaussian 09
title: 000144818
version: EM64L-G09RevD.01
frameworkgroup: C1[X(C10H14)]
method: RPBEPBE
basis: SDD
operation: Freq
keyword: #p
keyword: freq=noraman
keyword: PBEPBE/SDD
title: #p freq=noraman PBEPBE/SDD
converged: YES YES NO NO
title: Mulliken charges:
elementType: C C C C C C C C C C H H H H H H H H H H H H H H
charge: -0.163315 -0.163306 -0.502223 -0.502242 -0.217620 -0.217626 -0.181027 -0.181033 -0.462140 -0.462161 0.246719 0.246718 0.213528 0.228064 0.213524 0.228068 0.207500 0.207511 0.206380 0.206389 0.205591 0.218555 0.205596 0.218551
chargesum: 0.00000
title: Mulliken charges with hydrogens summed into heavy atoms:
elementType: C C C C C C C C C C
charge: 0.083404 0.083412 -0.060631 -0.060650 -0.010121 -0.010115 0.025353 0.025356 -0.037994 -0.038014
polarizability: 1.29212749e+02 5.49157999e-04 9.98427380e+01 -1.29269773e-03 4.33024203e+00 7.16563867e+01
1716.lowfreq: -5.8669 -0.0007 -0.0004 -0.0003 14.2653 19.9113 80.8607 125.2160 170.4325
frequency: 80.8375 125.1962 170.4243 187.3497 278.0990 295.5232 370.6169 377.9762 486.1246 490.6187 574.7516 637.1201 654.2521 673.0367 729.2355 778.3664 798.6807 815.2791 903.6600 936.8908 940.9642 945.5232 962.7112 979.5603 982.4650 1000.5930 1031.8296 1078.9140 1089.8297 1089.8587 1124.2835 1174.1347 1183.0136 1189.3180 1195.8933 1209.1632 1227.7273 1233.8138 1246.1868 1251.6562 1286.5586 1293.6609 1307.1335 1316.4776 1381.9148 1384.6586 1459.1606 1468.0387 1471.5951 1474.3183 1654.1392 1660.6115 2970.2227 2976.3454 2977.7606 2984.8961 3004.8472 3010.4006 3033.5135 3046.5755 3072.5864 3072.8063 3074.6412 3091.2582 3109.0313 3110.9259
redmass: 2.5758 2.1394 2.9996 2.3449 3.1603 2.6356 2.1877 2.2999 3.4910 2.7073 2.6112 3.2453 2.0745 1.7153 1.4099 2.1157 1.7944 1.4093 2.1998 1.5769 1.9574 2.4560 1.2723 1.7080 2.5188 2.8674 2.3850 2.2005 2.0242 3.1830 1.9183 1.1997 1.2184 1.1908 1.2304 1.1510 1.2689 1.3838 1.1310 1.1437 1.3431 1.3371 1.4384 1.3072 1.6017 1.5856 1.0852 1.0898 1.1210 1.0982 7.5927 7.3584 1.0821 1.0645 1.0629 1.0818 1.0574 1.0643 1.1015 1.0968 1.0845 1.0942 1.0960 1.1063 1.0978 1.0981
irintensity: 0.2376 0.0024 0.1578 0.0050 0.0067 1.4966 4.1634 0.0167 0.1488 1.4332 0.6649 5.7053 5.7637 0.0819 124.9089 0.2755 2.3403 0.8933 3.6105 2.2228 1.3684 5.1695 0.0070 3.8693 5.5213 0.1681 2.8394 0.8932 0.4661 0.0152 5.8902 2.9563 0.6248 0.4759 0.8371 9.3537 0.5821 3.4883 2.0497 1.0147 1.9762 0.7792 2.9361 0.2457 0.4969 0.1363 6.5616 3.1782 4.0099 18.9221 11.5995 0.0376 2.2906 19.5801 68.6430 7.7368 50.7000 43.2243 8.6254 55.9121 2.4175 45.7917 0.2899 62.8715 114.5379 8.2810
temp: 298.150 k
press: 1.00000 atm
elementType: 6 6 6 6 6 6 6 6 6 6 1 1 1 1 1 1 1 1 1 1 1 1 1 1
symmnumber: 1
zpe: 551451.9 jmol-1
zpe.correction: 0.210037 hartree
zpe.thermalcorrener: 0.219156 hartree
zpe.thermalcorrenthalpy: 0.220101 hartree
zpe.thermalcorrgfe: 0.176187 hartree
zpe.sumelectzpe: -388.625062 hartree
zpe.sumelectthermal: -388.615942 hartree
zpe.sumelectthermalent: -388.614998 hartree
zpe.sumelectthermalfe: -388.658912 hartree
dipole: -0.0683 0.0001 -0.0001
dipole: 0.0683
quadrupole: -57.8096 -61.9099 -61.9733
quadrupole: 0.0001 -0.0003 2.5558
quadrupole: 2.7547 -1.3456 -1.4090 0.0001 -0.0003 2.5558
hfenergy: -388.8350984 hartree
pointgroup: C01 [X(C10H14)]
dipole: 0.0268753 0.0000539 0.0000499 debye
dipolederiv: 0.0817663 0.0225485 -0.0236215 -0.0871565 -0.0505495 -0.0160199 -0.0672565 0.0391366 0.1497793 0.0817696 -0.0225424 0.0236114 0.0872255 -0.0505516 -0.0160118 0.0672845 0.0391291 0.1497504 0.0152949 -0.0715768 -0.0747041 -0.03344 -0.0039237 0.0044302 -0.0308185 -0.0241489 0.1675023 0.015244 0.071583 0.074671 0.0334381 -0.0038943 0.0044427 0.0307908 -0.0241294 0.1675307 -0.0310487 0.1099876 0.001242 0.1649806 0.0733546 -0.1634819 -0.0797911 -0.2104212 -0.1534497 -0.0310356 -0.1100057 -0.0012785 -0.1650091 0.0732468 -0.1635228 0.0797038 -0.2104628 -0.1533593 -0.0330808 -0.1279152 -0.0130113 -0.1495522 0.0726726 -0.2000419 0.0446174 -0.2184514 -0.1497346 -0.0330975 0.1278922 0.0130494 0.1495251 0.072589 -0.2000819 -0.0445183 -0.2185305 -0.1496533 0.1523713 0.0422916 -0.0071377 0.0973126 -0.0243747 0.0452835 0.0723311 0.0459626 0.0980132 0.15235 -0.0422679 0.007122 -0.0973092 -0.0243954 0.0453063 -0.0723967 0.0459512 0.0979934 0.0012293 -0.0195423 -0.0517386 -0.0526311 0.0462836 0.061771 -0.0162409 0.03091 -0.1264873 0.0012134 0.0195307 0.0517781 0.052586 0.0462881 0.0617765 0.0162698 0.0309127 -0.1264688 0.0518197 0.0194025 -0.0109539 0.0500468 -0.0234376 0.092478 -0.0701636 0.1170452 -0.0917291 -0.074315 0.0770775 0.0897856 0.0818471 0.0121331 -0.0610025 0.1435262 -0.0933054 -0.0475897 0.0518098 -0.0194137 0.0109654 -0.0500543 -0.0234499 0.0924742 0.0701793 0.1170528 -0.0917183 -0.0742468 -0.077069 -0.0897768 -0.0818486 0.0121122 -0.0610262 -0.1435178 -0.0933361 -0.047631 -0.0051114 0.0879911 -0.0499194 0.0411885 -0.0570752 0.0958978 -0.0302185 0.1421091 0.0939675 -0.0050925 -0.0879777 0.049948 -0.0411618 -0.0569946 0.0959419 0.0302312 0.1421573 0.093904 -0.0177152 -0.0812099 0.0343929 -0.0622713 -0.067499 0.1114013 0.0409251 0.1484838 0.0934889 -0.017738 0.0812242 -0.0344294 0.0622717 -0.0673797 0.1114266 -0.0409571 0.1485225 0.0934224 -0.1895752 -0.0828932 -0.0429984 -0.1131832 -0.0191419 -0.0242213 -0.0139601 -0.007043 0.0830138 0.0483899 0.0144919 0.08993 0.0537435 0.0415555 0.0535165 0.0195901 0.0297616 -0.1167883 -0.1895839 0.0828746 0.0430685 0.1131456 -0.0191115 -0.0242417 0.0140354 -0.0070641 0.0830047 0.0483825 -0.0144815 -0.0899946 -0.0536937 0.0415429 0.0535055 -0.0196456 0.0297583 -0.1167611 unknown
polarizability: 129.2127495|0.0012282|99.5076765|-0.0000369|-5.2993295|71.9914482 unknown
InChI: InChI=1S/C10H14/c1-2-4-6-10-8-7-9(10)5-3-1/h3-6,9-10H,1-2,7-8H2
charge 0 multiplicity 1
24 atoms
C  -0.935952 0.710863 0.362284
C  -0.935794 -0.710965 -0.362385
C  -2.483719 0.773175 0.127066
C  -2.483593 -0.773473 -0.127475
C  -0.052278 1.794743 -0.204082
C  -0.052064 -1.794689 0.20418
C  1.309726 1.777137 -0.189293
C  1.309937 -1.776939 0.189288
C  2.172615 0.673815 0.4119
C  2.172565 -0.67359 -0.412207
H  -0.713785 0.544612 1.436095
H  -0.713421 -0.544678 -1.436146
H  -2.727474 1.339293 -0.79073
H  -3.106477 1.151719 0.954132
H  -2.727458 -1.339621 0.790273
H  -3.10614 -1.152097 -0.954662
H  -0.562901 2.641885 -0.687271
H  -0.562602 -2.64172 0.687649
H  1.843649 2.613938 -0.662583
H  1.844025 -2.613521 0.662775
H  3.212061 1.041806 0.491787
H  1.836612 0.446575 1.44346
H  3.212024 -1.041481 -0.492387
H  1.836243 -0.446387 -1.443669
