program: Gaussian 09
title: 000144816
version: EM64L-G09RevD.01
frameworkgroup: C1[X(C5H6F2)]
method: RPBEPBE
basis: SDD
operation: Freq
keyword: #p
keyword: freq=noraman
keyword: PBEPBE/SDD
title: #p freq=noraman PBEPBE/SDD
converged: YES YES NO NO
title: Mulliken charges:
elementType: F F C C C C C H H H H H H
charge: -0.209063 -0.208872 0.352339 -0.504915 -0.504914 -0.203227 -0.203228 0.248131 0.250146 0.250148 0.248129 0.242663 0.242664
chargesum: 0.00000
title: Mulliken charges with hydrogens summed into heavy atoms:
elementType: F F C C C C C
charge: -0.209063 -0.208872 0.352339 -0.006638 -0.006638 0.039436 0.039436
polarizability: 5.14179080e+01 -6.10543811e-07 5.84888710e+01 4.05126843e-01 -9.43670621e-05 3.78871782e+01
1716.lowfreq: -5.4046 0.0011 0.0013 0.0013 6.2461 20.1266 28.0888 301.2062 370.6140
frequency: 27.8375 301.2057 370.6115 373.3225 413.6387 453.0065 594.7151 661.7867 770.4343 775.6326 818.3604 917.4424 955.6715 964.6833 978.5011 1030.9228 1083.8632 1116.0926 1127.3705 1175.6874 1221.2360 1270.7041 1317.6529 1339.8891 1443.7445 1449.2904 1637.9409 3010.4525 3013.0424 3066.2651 3067.1176 3157.9246 3190.3352
redmass: 3.0974 5.5082 1.8069 10.1204 2.4356 4.6997 11.9339 1.1916 6.2539 3.9577 2.7372 1.4895 1.3767 1.7588 2.6157 1.8523 3.2072 1.2232 1.1092 5.6119 1.5093 1.5466 1.9888 1.7657 1.0764 1.1000 6.0377 1.0603 1.0609 1.1014 1.1020 1.0867 1.1069
irintensity: 3.1795 0.0022 0.1091 8.1371 2.9273 7.2376 3.2865 49.7670 6.9197 4.8907 110.2254 0.0077 0.0148 27.2942 0.0459 15.5810 63.3661 11.2597 0.1560 30.3969 65.2308 5.6245 71.7944 0.2359 32.5201 0.4221 1.5020 17.3685 7.1226 0.1226 15.5322 3.0529 19.6947
temp: 298.150 k
press: 1.00000 atm
elementType: 9 9 6 6 6 6 6 1 1 1 1 1 1
symmnumber: 1
zpe: 257773.6 jmol-1
zpe.correction: 0.098181 hartree
zpe.thermalcorrener: 0.104448 hartree
zpe.thermalcorrenthalpy: 0.105392 hartree
zpe.thermalcorrgfe: 0.067087 hartree
zpe.sumelectzpe: -393.266769 hartree
zpe.sumelectthermal: -393.260501 hartree
zpe.sumelectthermalent: -393.259557 hartree
zpe.sumelectthermalfe: -393.297863 hartree
dipole: 2.9491 0.0000 -0.1759
dipole: 2.9543
quadrupole: -42.9011 -34.6175 -43.5197
quadrupole: 0.0000 0.0500 0.0001
quadrupole: -2.5550 5.7286 -3.1736 0.0000 0.0500 0.0001
hfenergy: -393.3649495 hartree
pointgroup: C01 [X(C5H6F2)]
dipole: -1.1606158 0.0000547 0.0630239 debye
dipolederiv: -0.5367999 0.00003 0.2613172 0.00003 -0.2894249 -0.0000372 0.2409265 -0.0000353 -0.6356363 -0.5916431 -0.000007 -0.2675767 -0.0000073 -0.2878323 -0.0000114 -0.2543304 -0.0000112 -0.5939657 1.0960594 -0.000017 0.0063797 -0.0000167 0.6857592 0.0000378 0.0083719 0.0000341 1.1842436 -0.1602236 -0.0338932 -0.0049456 -0.1010754 -0.2043554 0.0105401 -0.0077405 0.0103232 0.0947435 -0.1602125 0.0338876 -0.0049473 0.1010696 -0.2043712 -0.0104994 -0.0077475 -0.0102661 0.0947461 0.1357123 -0.0677944 0.0100017 -0.0769518 0.0356804 -0.001519 0.0156537 -0.009204 -0.2396452 0.1357243 0.0677889 0.0099836 0.076946 0.0356689 0.0014858 0.0156313 0.0091443 -0.2396474 0.0556613 0.0485979 -0.0262892 0.0118123 0.049234 0.0779943 -0.04363 0.1109066 -0.0199792 0.055563 0.0532374 0.0284939 0.0191648 0.0333339 -0.0799979 0.0469714 -0.1127703 0.0011753 0.0555564 -0.0532367 0.0285075 -0.0191558 0.0333706 0.0799906 0.046982 0.1127618 0.0011501 0.055657 -0.0486008 -0.0262902 -0.011823 0.0492102 -0.0780021 -0.0436398 -0.1109122 -0.0199543 -0.0705339 -0.074154 -0.0073141 -0.0804267 0.0318695 -0.002517 -0.0087196 -0.0019365 0.186385 -0.0705205 0.0741613 -0.0073206 0.0804339 0.0318572 0.0025354 -0.008729 0.0019656 0.1863846 unknown
polarizability: 51.4132136|0.0003319|58.4888709|0.4770994|-0.0011126|37.8918726 unknown
InChI: InChI=1S/C5H6F2/c6-5(7)3-1-2-4-5/h1-2H,3-4H2
charge 0 multiplicity 1
13 atoms
F  1.49254 -0.000142 -1.127988
F  1.599444 0.000029 1.150888
C  0.663348 -0.000015 0.054388
C  -0.234935 -1.257454 0.085749
C  -0.234827 1.257506 0.085559
C  -1.639503 -0.679518 0.036981
C  -1.639446 0.679683 0.036919
H  -0.046624 -1.839177 1.006686
H  -0.007004 -1.912712 -0.774147
H  -0.006848 1.91262 -0.774436
H  -0.046457 1.839345 1.006408
H  -2.5308 -1.312672 0.009113
H  -2.530689 1.312908 0.008981
