program: Gaussian 09
title: 000144805
version: EM64L-G09RevD.01
frameworkgroup: C1[X(C9H9FO2S)]
method: RPBEPBE
basis: SDD
operation: Freq
keyword: #p
keyword: freq=noraman
keyword: PBEPBE/SDD
title: #p freq=noraman PBEPBE/SDD
converged: YES YES NO NO
title: Mulliken charges:
elementType: S F O O C C C C C C C C C H H H H H H H H H
charge: 0.936461 -0.193614 -0.568073 -0.550784 0.493443 -0.524070 -0.165325 -0.740725 -0.352036 -0.333524 -0.372135 -0.363449 0.326908 0.279939 0.290841 0.263016 0.267512 0.294942 0.248736 0.235251 0.264471 0.262213
chargesum: 0.00000
title: Mulliken charges with hydrogens summed into heavy atoms:
elementType: S F O O C C C C C C C C C
charge: 0.936461 -0.193614 -0.568073 -0.550784 0.493443 -0.244130 0.125517 0.084746 -0.103301 -0.098273 -0.107664 -0.101236 0.326908
polarizability: 2.23790947e+02 1.03981555e+01 1.22136778e+02 -2.02008794e+00 1.23940389e+00 7.43699707e+01
1716.lowfreq: -7.4367 -1.8623 0.0014 0.0017 0.0018 4.4574 33.0119 51.8193 73.2198
frequency: 32.9951 51.7739 73.1922 96.0958 161.2120 170.2644 195.1678 204.1649 227.7232 258.2743 332.6155 357.9746 365.3057 387.8701 416.5705 436.2456 489.7399 512.2927 579.6387 628.5468 669.0272 717.8500 758.9055 782.6385 800.0827 817.4629 839.9694 844.7619 885.0049 949.2678 961.1697 971.6882 1003.8145 1004.4413 1005.6715 1101.2678 1152.5791 1159.8395 1209.0202 1233.3853 1286.4917 1302.4204 1314.8002 1381.7215 1407.6375 1415.2885 1421.9466 1496.4819 1589.5445 1611.1168 1624.0263 3029.2595 3064.5713 3143.9907 3149.9473 3177.6220 3178.2937 3181.4905 3183.6723 3184.7700
redmass: 4.3510 6.4457 6.4694 4.3623 1.3568 3.0203 2.7357 5.5896 5.5997 4.7088 5.7058 7.4030 8.3059 4.6638 3.0639 4.5082 8.6549 2.5541 7.8062 7.2072 4.9032 3.2631 5.1322 6.7685 1.9294 1.2635 5.0997 1.6448 3.1197 1.3457 1.3669 1.3299 1.6230 1.8931 1.7498 1.3311 1.1682 1.4553 1.8950 3.4893 1.3864 1.1436 1.3719 4.4972 1.0519 3.7299 1.0539 2.6180 7.5074 6.2981 6.1622 1.0247 1.0883 1.0905 1.0893 1.1067 1.0962 1.0966 1.1024 1.1028
irintensity: 2.5912 4.4043 2.1041 5.1534 0.3830 0.9537 1.1642 0.5708 0.1296 1.0631 24.0289 25.7505 47.5628 3.6846 0.1979 4.1696 1.5384 19.1163 35.7066 0.5452 76.4422 13.4480 10.6185 31.1472 124.4767 6.4058 14.9351 36.8633 30.3859 6.7205 0.3225 92.1860 45.5557 12.9887 38.9340 2.4845 19.5667 66.0012 28.2332 51.0938 5.1102 3.1922 13.7649 17.6047 10.1721 7.5031 14.1315 97.9442 4.8618 94.8473 24.1935 1.4180 2.5678 4.8331 6.1308 0.6064 2.5088 1.7528 11.3104 5.5499
temp: 298.150 k
press: 1.00000 atm
elementType: 16 9 8 8 6 6 6 6 6 6 6 6 6 1 1 1 1 1 1 1 1 1
symmnumber: 1
zpe: 412655.5 jmol-1
zpe.correction: 0.157172 hartree
zpe.thermalcorrener: 0.170476 hartree
zpe.thermalcorrenthalpy: 0.171420 hartree
zpe.thermalcorrgfe: 0.116164 hartree
zpe.sumelectzpe: -995.565806 hartree
zpe.sumelectthermal: -995.552502 hartree
zpe.sumelectthermalent: -995.551558 hartree
zpe.sumelectthermalfe: -995.606814 hartree
dipole: 2.3947 -1.4798 4.3491
dipole: 5.1807
quadrupole: -101.3804 -79.2889 -87.1303
quadrupole: 5.7277 -17.4821 -1.8465
quadrupole: -12.1138 9.9776 2.1362 5.7277 -17.4821 -1.8465
hfenergy: -995.722978 hartree
pointgroup: C01 [X(C9H9F1O2S1)]
dipole: 0.8971562 -0.9580149 1.5593866 debye
dipolederiv: 2.1391216 0.1479567 0.0394837 -0.2664326 1.1465731 -0.0880201 -0.1500808 -0.053114 1.3616991 -1.3907731 0.0275862 -0.0555379 0.0757833 -0.2045626 -0.0115294 -0.0554385 -0.0135929 -0.15275 -0.7224967 -0.0136096 0.0206276 0.1263032 -0.6655133 0.0602548 0.0702209 -0.0650609 -0.5260392 -0.8260121 -0.0474626 -0.0617116 -0.0709023 -0.5306046 -0.1202989 -0.0251256 0.0031419 -0.6566953 -0.3236993 0.0092635 -0.0073653 0.0361966 -0.0733503 -0.0289735 0.0266475 -0.0271498 0.036972 -0.777814 -0.1296469 -0.0340391 -0.2844542 -0.1619453 0.0780599 -0.0274734 0.0813586 -0.4100888 0.7224322 0.0518042 0.0324039 0.317624 0.0419602 0.0260322 0.0964266 0.019051 -0.0559866 -0.29668 -0.0350346 0.0049608 0.028873 -0.1251408 0.0771401 0.0245168 0.0553597 -0.2346152 0.1465432 -0.0316718 0.0082915 0.1085439 0.089928 0.0626087 0.0443014 0.0499566 -0.1247702 0.1389212 0.0045529 0.0180009 -0.116298 0.0517161 0.0438462 -0.0066963 0.0519511 -0.1020796 -0.2972386 0.0693918 0.013088 0.3163029 -0.0578305 0.0396 0.068179 0.0277399 -0.139007 -0.3835614 -0.0556543 -0.0239231 -0.3082717 -0.0374052 0.0142819 -0.0995955 0.0278239 -0.144603 1.4776649 -0.0418052 0.0633154 -0.0378554 0.3057257 0.0506947 0.0750212 0.0505772 0.1202248 -0.1075053 0.0555004 -0.0074837 0.1040934 0.0336906 -0.0367157 -0.0504173 -0.0434964 0.1877952 0.1505714 0.0125251 0.0003949 0.0151053 0.0379037 -0.0242449 -0.0067313 -0.0230939 0.1348466 0.1140247 0.0136055 0.0377714 0.0272452 -0.0485563 0.0126053 0.0345098 0.0118541 0.0422776 0.072017 -0.0454182 -0.021296 -0.059596 0.0655565 -0.010505 -0.0514373 -0.0160501 -0.0365335 -0.0339669 0.0192485 0.0057725 -0.0045289 0.0954191 0.020031 0.0634714 0.0275563 0.085578 0.0580743 0.0879094 0.0158409 0.0632424 -0.0070788 -0.0396416 0.0125042 -0.0356804 0.1451021 0.0580479 -0.0923627 -0.031574 -0.0728839 -0.0028108 -0.0413362 -0.0260351 -0.0444468 0.1276864 0.0344332 -0.0576683 -0.023146 -0.067177 0.031258 -0.0434931 -0.0263864 -0.0431295 0.1708371 0.0478961 0.0509899 0.0061252 0.0690868 0.0150675 -0.0403964 0.0096186 -0.0415554 0.1701496 unknown
polarizability: 222.4222051|13.7893768|119.4483018|7.8702248|13.4836451|78.4271888 unknown
InChI: InChI=1S/C9H9FO2S/c1-13(11,12)7-6-8-2-4-9(10)5-3-8/h2-7H,1H3
charge 0 multiplicity 1
22 atoms
S  -3.460521 -0.162482 -0.425103
F  4.922793 -0.141294 0.156545
O  -3.493262 1.461276 -0.189935
O  -4.119989 -0.867537 -1.746615
C  0.722693 0.117391 -0.021612
C  -1.654082 -0.695709 -0.342105
C  -0.74053 0.265376 -0.065036
C  -4.286022 -0.962534 1.106953
C  1.506546 1.255696 0.320965
C  1.38738 -1.110266 -0.308428
C  2.912507 1.182589 0.384098
C  2.78967 -1.202764 -0.250834
C  3.52195 -0.050572 0.09696
H  -1.518529 -1.742488 -0.625516
H  -1.146573 1.271214 0.137174
H  -4.161218 -2.050032 1.012131
H  -3.78808 -0.547032 1.993236
H  -5.341503 -0.662585 1.043682
H  1.006924 2.206657 0.537101
H  0.808657 -1.997727 -0.584272
H  3.524197 2.050518 0.644958
H  3.315792 -2.136096 -0.470248
